{"text_format":"1","workbook":"xlsx","n_sheets":3,"sheets":["Kold","Brand","Ark1"],"not_rendered":{"charts":3,"images":1,"macros":1,"external_links":0,"defined_names":7,"comments":0,"pivot_tables":0},"unopened":[],"bounds":{"document_bytes":16777216,"sheet_cells":100000,"rows_first":2000,"rows_last":500,"rows_between":2000,"halvings":0,"cell_chars":16384,"cell_head_chars":4096},"cells_cut":0,"cells_raw":0,"read":"whole","date_system":"1900"}

{"sheet":"Kold","index":0,"n_rows":39,"n_cols":124,"rows_kept":39,"cut":false,"hidden":false,"merged":[[8,58,8,60],[5,12,6,13],[5,14,6,14],[5,20,6,20],[5,17,6,19],[22,83,22,89],[13,13,13,14],[14,13,14,14],[19,13,19,14],[20,13,20,14],[18,13,18,14],[22,18,22,20],[22,115,22,122],[22,91,22,98],[22,99,22,106],[22,107,22,114],[2,3,2,8],[3,3,3,8],[5,15,6,15],[2,12,3,20],[4,12,4,20],[8,13,8,14],[22,58,22,61],[22,62,22,68],[22,69,22,75],[22,76,22,82],[5,16,6,16],[2,10,2,11],[22,2,22,3],[22,8,22,11],[22,15,22,17],[3,10,3,11],[10,13,10,14],[11,13,11,14],[12,13,12,14],[22,4,22,7],[22,12,22,14]]}
[]
[null,null,null,null,null,null,null,null,null,null,null,null,"Lastnedføring version 3.0",null,null,null,null,null,null,null,"Udgivet af Betonelement-Foreningen juni 2012"]
[null,"Sag:",null,"Betonelementhuset",null,null,null,null,null,"Nr.:","23 - 4545",null,{"$f":"BM34","v":""}]
[null,"Emne:",null,"Linie B, modul 5-12.",null,null,null,null,null,"Init:","JFJ"]
[null,null,null,"Vedvarende dimensioneringstilstande (kombination 6.10b)"]
[null,null,null,null,null,null,null,null,null,null,null,null," Egenvægt, gg,sup =",null,1,"gg,inf  =",0.9," Konsekvensklasse:  KFI =",null,null,1.1000000000000001]
[]
[null,null,null,null,null,null,null,null,null,null,null,null," Fladelaste",null,null,"gk","gfri,k","qk","gq","y0","Kategori"]
[null,null,null,null,null,null,null,null,null,null,null,null,null,null,null,"(kN/m2)","(kN/m2)","(kN/m2)",null,null,null,null,null,null,null,null,null,null,null,null,null,null,null,null,null,null,null,null,null,null,null,null,null,null,null,null,null,null,null,null,null,null,null,null,null,null,null,null,"Lastkategorier",null,null,"y0","y1","y2",null,"y0","y1","y2","Kontrol for E","Kontrol Sne"]
[null,null,null,null,null,null,null,null,null,null,null,null,"F0",null,null,0,0,0,null,null,null,null,null,null,null,null,null,null,null,null,null,null,null,null,null,null,null,null,null,null,null,null,null,null,null,null,null,null,null,null,null,null,null,null,null,null,null,null,"A",null,null,1,2,3,"A",0.5,0.3,0.2,{"$f":"MAX(BQ11:BQ17)","v":1}]
[null,null,null,null,null,null,null,null,null,null,null,null,"F1","Tagflade, sne",null,3.1,1,0.8,1.5,0.6,{"$f":"INDEX($BG$10:$BG$17,BI11,1)","v":"N"},null,null,null,null,null,null,null,null,null,null,null,null,null,null,null,null,null,null,null,null,null,null,null,null,null,null,null,null,null,null,null,null,null,null,null,null,null,"B","F1",8,{"$f":"INDEX(psi,$BI11,BJ$10)","v":0.6},0.2,0,"B",0.6,0.4,0.2,{"$f":"IF(BI11=5,1,0)","v":0},{"$f":"IF(AND(BI11=8,T11<>BJ11),1,0)","v":0}]
[null,null,null,null,null,null,null,null," L1 og L2 betegner linielaste.",null,null,null,"F2","Boligarealer",null,3.65,1.5,1.5,1.5,0.5,{"$f":"INDEX($BG$10:$BG$17,BI12,1)","v":"A"},null,null,null,null,null,null,null,null,null,null,null,null,null,null,null,null,null,null,null,null,null,null,null,null,null,null,null,null,null,null,null,null,null,null,null,null,null,"C","F2",1,0.5,0.3,0.2,"C",0.6,0.6,0.5,{"$f":"IF(BI12=5,1,0)","v":0}]
[null,null,null,null,null,null,null,null," Lv og Lh er dækkenes spændvidder.",null,null,null,"F3","Kontorer",null,3.65,2,2.5,1.5,0.6,{"$f":"INDEX($BG$10:$BG$17,BI13,1)","v":"B"},null,null,null,null,null,null,null,null,null,null,null,null,null,null,null,null,null,null,null,null,null,null,null,null,null,null,null,null,null,null,null,null,null,null,null,null,null,"D","F3",2,0.6,0.4,0.2,"D",0.6,0.6,0.5,0]
[null,null,null,null,null,null,null,null," Resultanter på underliggende væg",null,null,null,"F4","Kontor med arkiv",null,3.65,2,7.5,1.5,1,{"$f":"INDEX($BG$10:$BG$17,BI14,1)","v":"E"},null,null,null,null,null,null,null,null,null,null,null,null,null,null,null,null,null,null,null,null,null,null,null,null,null,null,null,null,null,null,null,null,null,null,null,null,null,"E","F4",5,{"$f":"INDEX(psi,$BI14,BJ$10)","v":1},0.8,0.7,"E",1,0.8,0.7,1]
[null,null,null,null,null,null,null,null,"eller bjælke:",null,null,null,"F5","Butiksarealer",null,4.1500000000000004,4,4,1.5,0.6,{"$f":"INDEX($BG$10:$BG$17,BI15,1)","v":"D"},null,null,null,null,null,null,null,null,null,null,null,null,null,null,null,null,null,null,null,null,null,null,null,null,null,null,null,null,null,null,null,null,null,null,null,null,null,"F","F5",4,0.6,0.6,0.5,"F",1,0.6,0.5,0]
[null,null,null,null,null,null,null,null,null,null,null,null,{"$f":"IF(MAX(BJ11:BJ17)=1,\"NB:  EC1 3.3.1(2)P fjerner reelt lastreduktion for kategori E-G i normale lastkombinationer\",\"\")","v":"NB:  EC1 3.3.1(2)P fjerner reelt lastreduktion for kategori E-G i normale lastkombinationer"},null,null,null,null,null,null,null,null,null,null,null,null,null,null,null,null,null,null,null,null,null,null,null,null,null,null,null,null,null,null,null,null,null,null,null,null,null,null,null,null,null,null,null,null,null,"G","L1",1,0.5,0.3,0.2,"G",1,0.4,0.2,0]
[null,null,null,null,null,null,null,null,null,null,null,null,"Linielaste",null,null,"gk","gfri,k","qk","gq","y0","Kategori",null,null,null,null,null,null,null,null,null,null,null,null,null,null,null,null,null,null,null,null,null,null,null,null,null,null,null,null,null,null,null,null,null,null,null,null,null,"N","L2",4,0.6,0.6,0.5,"N",{"$f":"IF(BQ10=1,0.6,0.3)","v":0.6},0.2,0,0]
[null,null,null,null,null,null,null,null,null,null,null,null,null,null,null,"(kN/m)","(kN/m)","(kN/m)"]
[null,null,null,null,null,null,null,null,null,null,null,null,"L0",null,null,0,0,0]
[null,null,null,null,null,null,null,null," nv og nh : Laste fra dæk i etagen",null,null,null,"L1","Badeværelser",null,8,4,6,1.5,0.5,{"$f":"INDEX($BG$10:$BG$17,BI16,1)","v":"A"}]
[null,null,null,null,null,null,null,null," no : Last fra højereliggende dæk og",null,null,null,"L2","Komprimator",null,0,8,10,1.5,0.6,{"$f":"INDEX($BG$10:$BG$17,BI17,1)","v":"D"}]
[null,null,null,null,null,null,null,null," fra egenvægte i bærelinie"]
[null,"Etage","Egenvægt i bærelinie",null,"Laste på venstre dækfelt",null,null,null,"Laste på højre dækfelt",null,null,null,"maksimalværdier",null,null,"reducerede værdier",null,null,"minimalværdier",null,null,null,null,null,null,null,null,null,null,null,null,null,null,null,null,null,null,null,null,null,null,null,null,null,null,null,null,null,null,null,null,null,null,null,null,null,null,null,"Spændvidder",null,null,null,"Fladelaste, venstre dækfelt",null,null,null,null,null,null,"Linielaste, venstre dækfelt",null,null,null,null,null,null,"Fladelaste, højre dækfelt",null,null,null,null,null,null,"Linielaste, højre dækfelt",null,null,null,null,null,null,"Ng","DNmax (q)",null,null,null,null,null,null,null,"DNsædv (q)",null,null,null,null,null,null,null,"Nmax (q)",null,null,null,null,null,null,null,"Nsædv (q)",null,null,null,null,null,null,null,"No (q)"]
[null,null,"gk","gfri,k","Lv","Fladelast","Linielast","sv","Lh","Fladelast","Linielast","sh","nv","no","nh","nv","no","nh","nv","no","nh",null,null,null,null,null,null,null,null,null,null,null,null,null,null,null,null,null,null,null,null,null,null,null,null,null,null,null,null,null,null,null,null,null,null,null,null,null,"Lv","sv","Lh","sh",null,"gk","gg","qk","gq","gqyq","Kategori",null,"gk","gg","qk","gq","gqyq","Kategori",null,"gk","gg","qk","gq","gqyq","Kategori",null,"gk","gg","qk","gq","gqyq","Kategori",null,"A","B","C","D","E","F","G","N","A","B","C","D","E","F","G","N","A","B","C","D","E","F","G","N","A","B","C","D","E","F","G","N"]
[null,null,"(kN/m)","(kN/m)","(m)",null,null,"(m)","(m)",null,null,"(m)","(kN/m)","(kN/m)","(kN/m)","(kN/m)","(kN/m)","(kN/m)","(kN/m)","(kN/m)","(kN/m)"]
[null,"Tag",null,null,8.4,{"$f":"INDEX($M$10:$M$15,BK26,1)","v":"F1"},{"$f":"INDEX($M$19:$M$21,BR26,1)","v":"L0"},0,6,{"$f":"INDEX($M$10:$M$15,BY26,1)","v":"F1"},{"$f":"INDEX($M$19:$M$21,CF26,1)","v":"L0"},0,{"$f":"IF($BL$34=1,\"-\",0.5*BG26*(BL26*BM26+BN26*BO26)+IF(E26>0,(BG26-BH26)*(BS26*BT26+BU26*BV26)/BG26,0))","v":24.48602915},{"$f":"IF($BL$34=1,\"-\",CM26+DT26)","v":11},{"$f":"IF($BL$34=1,\"-\",0.5*BI26*(BZ26*CA26+CB26*CC26)+IF(I26>0,(BI26-BJ26)*(CG26*CH26+CI26*CJ26)/BI26))","v":17.490029149999998},{"$f":"IF($BL$34=1,\"-\",$U$6*(0.5*E26*($O$6*INDEX(fladelast,BK26,1)+$O$6*INDEX(fladelast,BK26,2)+INDEX(fladelast,BK26,3)*INDEX(fladelast,BK26,5)*INDEX(fladelast,BK26,4))+IF(E26>0,($O$6*INDEX(linielast,BR26,1)+$O$6*INDEX(linielast,BR26,2)+INDEX(linielast,BR26,3)*INDEX(linielast,BR26,5)*INDEX(linielast,BR26,4))*(E26-H26)/E26,0)))","v":22.268400000000003},{"$f":"IF($BL$34=1,\"-\",$U$6*$O$6*(C27+D27))","v":11},{"$f":"IF($BL$34=1,\"-\",$U$6*(0.5*I26*($O$6*INDEX(fladelast,BY26,1)+$O$6*INDEX(fladelast,BY26,2)+INDEX(fladelast,BY26,3)*INDEX(fladelast,BY26,5)*INDEX(fladelast,BY26,4))+IF(I26>0,($O$6*INDEX(linielast,CF26,1)+$O$6*INDEX(linielast,CF26,2)+INDEX(linielast,CF26,3)*INDEX(linielast,CF26,5)*INDEX(linielast,CF26,4))*(I26-L26)/I26)))","v":15.905999999999999},{"$f":"IF(BL34=1,\"-\",$Q$6*(0.5*E26*INDEX(fladelast,BK26,1)+IF(E26>0,INDEX(linielast,BR26,1)*(E26-H26)/E26)))","v":11.718000000000002},{"$f":"IF(BL34=1,\"-\",$Q$6*C27)","v":9},{"$f":"IF(BL34=1,\"-\",$Q$6*(0.5*I26*INDEX(fladelast,BY26,1)+IF(I26>0,INDEX(linielast,CF26,1)*(I26-L26)/I26)))","v":8.370000000000001},null,null,null,null,null,null,null,null,null,null,null,null,null,null,null,null,null,null,null,null,null,null,null,null,null,null,null,null,null,null,null,null,null,null,null,null,null,{"$f":"E26+0.00001","v":8.40001},{"$f":"H26","v":0},{"$f":"I26+0.00001","v":6.0000099999999996},{"$f":"L26","v":0},2,{"$f":"INDEX(fladelast,$BK26,1)+INDEX(fladelast,$BK26,2)","v":4.0999999999999996},{"$f":"$U$6*$O$6","v":1.1000000000000001},{"$f":"INDEX(fladelast,$BK26,3)","v":0.8},{"$f":"$U$6*INDEX(fladelast,$BK26,4)","v":1.6500000000000001},{"$f":"BO26*INDEX(fladelast,$BK26,5)","v":0.99},{"$f":"INDEX(fladelast,$BK26,6)","v":"N"},1,{"$f":"INDEX(linielast,$BR26,1)+INDEX(linielast,$BR26,2)","v":0},{"$f":"$U$6*$O$6","v":1.1000000000000001},{"$f":"INDEX(linielast,$BR26,3)","v":0},{"$f":"$U$6*INDEX(linielast,$BR26,4)","v":0},{"$f":"BV26*INDEX(linielast,$BR26,5)","v":0},{"$f":"INDEX(linielast,$BR26,6)","v":0},2,{"$f":"INDEX(fladelast,$BY26,1)+INDEX(fladelast,$BY26,2)","v":4.0999999999999996},{"$f":"$U$6*$O$6","v":1.1000000000000001},{"$f":"INDEX(fladelast,$BY26,3)","v":0.8},{"$f":"$U$6*INDEX(fladelast,$BY26,4)","v":1.6500000000000001},{"$f":"CC26*INDEX(fladelast,$BY26,5)","v":0.99},{"$f":"INDEX(fladelast,$BY26,6)","v":"N"},1,{"$f":"INDEX(linielast,$CF26,1)+INDEX(linielast,$CF26,2)","v":0},{"$f":"$U$6*$O$6","v":1.1000000000000001},{"$f":"INDEX(linielast,$CF26,3)","v":0},{"$f":"$U$6*INDEX(linielast,$CF26,4)","v":0},{"$f":"CJ26*INDEX(linielast,$CF26,5)","v":0},{"$f":"INDEX(linielast,$CF26,6)","v":0},{"$f":"(C27+D27)*$U$6*$O$6","v":11},{"$f":"IF($BQ26=CN$24,0.5*$BG26*$BN26*$BO26,0)+IF(AND($BX26=CN$24,$E26>0),($BG26-$BH26)*$BU26*$BV26/$BG26,0)+IF($CE26=CN$24,0.5*$BI26*$CB26*$CC26,0)+IF(AND($CL26=CN$24,$I26>0),($BI26-$BJ26)*$CI26*$CJ26/$BI26,0)","v":0},0,0,0,0,0,0,9.504013200000001,{"$f":"IF($BQ26=CV$24,0.5*$BG26*$BN26*$BP26,0)+IF(AND($BX26=CV$24,$E26>0),($BG26-$BH26)*$BU26*$BW26/$BG26,0)+IF($CE26=CV$24,0.5*$BI26*$CB26*$CD26,0)+IF(AND($CL26=CV$24,$I26>0),($BI26-$BJ26)*$CI26*$CK26/$BI26,0)","v":0},0,0,0,0,{"$f":"IF($BQ26=DA$24,0.5*$BG26*$BN26*$BP26,0)+IF(AND($BX26=DA$24,$E26>0),($BG26-$BH26)*$BU26*$BW26/$BG26,0)+IF($CE26=DA$24,0.5*$BI26*$CB26*$CD26,0)+IF(AND($CL26=DA$24,$I26>0),($BI26-$BJ26)*$CI26*$CK26/$BI26,0)","v":0},0,5.7024079199999997,0,0,0,0,0,0,0,0,0,0,0,0,0,0,0,0,{"$f":"IF(DK26>DS26,DK26+SUM(DL26:DR26),DS26+SUM(DD26:DJ26))","v":0}]
[null,"4. sal",10,0,8.4,"F2","L1",2,6,"F2","L0",0,51.78804724761126,{"$f":"IF($BL$34=1,\"-\",CM27+DT27)","v":63.976058300000005},24.420040700000001,42.819071428571434,{"$f":"IF($BL$34=1,\"-\",P26+Q26+R26+$U$6*$O$6*(C28+D28))","v":60.174399999999999},20.707500000000003,{"$f":"IF(BL34=1,\"-\",$Q$6*(0.5*E27*INDEX(fladelast,BK27,1)+IF(E27>0,INDEX(linielast,BR27,1)*(E27-H27)/E27)))","v":19.282714285714285},{"$f":"IF(BL34=1,\"-\",S26+T26+U26+$Q$6*C28)","v":38.088000000000008},{"$f":"IF(BL34=1,\"-\",$Q$6*(0.5*I27*INDEX(fladelast,BY27,1)+IF(I27>0,INDEX(linielast,CF27,1)*(I27-L27)/I27)))","v":9.8550000000000004},null,null,null,null,null,null,null,null,null,null,null,null,null,null,null,null,null,null,null,null,null,null,null,null,null,null,null,null,null,null,null,null,null,null,null,null,null,8.40001,2,6.0000099999999996,0,3,5.15,1.1000000000000001,1.5,1.6500000000000001,0.82500000000000007,"A",2,12,1.1000000000000001,6,1.6500000000000001,0.82500000000000007,"A",3,5.15,1.1000000000000001,1.5,1.6500000000000001,0.82500000000000007,"A",1,0,1.1000000000000001,0,0,0,0,{"$f":"CM26+0.5*BG26*(BL26*BM26)+IF(E26>0,(BG26-BH26)*(BS26*BT26)/BG26)+0.5*BI26*(BZ26*CA26)+IF(I26>0,(BI26-BJ26)*(CG26*CH26)/BI26)+(C28+D28)*$U$6*$O$6","v":54.472045100000003},{"$f":"IF($BQ27=CN$24,0.5*$BG27*$BN27*$BO27,0)+IF(AND($BX27=CN$24,$E27>0),($BG27-$BH27)*$BU27*$BV27/$BG27,0)+IF($CE27=CN$24,0.5*$BI27*$CB27*$CC27,0)+IF(AND($CL27=CN$24,$I27>0),($BI27-$BJ27)*$CI27*$CJ27/$BI27,0)","v":25.362884698976252},0,0,0,0,0,0,0,12.681442349488126,0,0,0,0,0,0,0,{"$f":"MAX(DD26+CV26,DL26+CN26)","v":0},0,0,0,0,{"$f":"MAX(DI26+DA26,DQ26+CS26)","v":0},0,{"$f":"IF(DK26+CU26-DS27>SUM(DD27:DJ27)-SUM(DL27:DR27),DK26+CU26,DS27)","v":9.504013200000001},{"$f":"DL26+CV26","v":0},0,0,0,0,{"$f":"DQ26+DA26","v":0},0,5.7024079199999997,{"$f":"IF(DK27>DS27,DK27+SUM(DL27:DR27),DS27+SUM(DD27:DJ27))","v":9.504013200000001}]
[null,"3. sal",10,0,8.4,"F2","L1",2,6,"F2","L0",0,51.78804724761126,147.38254096761128,24.420040700000001,42.819071428571434,{"$f":"IF($BL$34=1,\"-\",P27+Q27+R27+$U$6*$O$6*(C29+D29))","v":134.70097142857145},20.707500000000003,{"$f":"IF(BL34=1,\"-\",$Q$6*(0.5*E28*INDEX(fladelast,BK28,1)+IF(E28>0,INDEX(linielast,BR28,1)*(E28-H28)/E28)))","v":19.282714285714285},{"$f":"IF(BL34=1,\"-\",S27+T27+U27+$Q$6*C29)","v":76.22571428571429},{"$f":"IF(BL34=1,\"-\",$Q$6*(0.5*I28*INDEX(fladelast,BY28,1)+IF(I28>0,INDEX(linielast,CF28,1)*(I28-L28)/I28)))","v":9.8550000000000004},null,null,null,null,null,null,null,null,null,null,null,null,null,null,null,null,null,null,null,null,null,null,null,null,null,null,null,null,null,null,null,null,null,null,null,null,null,8.40001,2,6.0000099999999996,0,3,5.15,1.1000000000000001,1.5,1.6500000000000001,0.82500000000000007,"A",2,12,1.1000000000000001,6,1.6500000000000001,0.82500000000000007,"A",3,5.15,1.1000000000000001,1.5,1.6500000000000001,0.82500000000000007,"A",1,0,1.1000000000000001,0,0,0,0,{"$f":"CM27+0.5*BG27*(BL27*BM27)+IF(E27>0,(BG27-BH27)*(BS27*BT27)/BG27)+0.5*BI27*(BZ27*CA27)+IF(I27>0,(BI27-BJ27)*(CG27*CH27)/BI27)+(C29+D29)*$U$6*$O$6","v":116.31724834863502},25.362884698976252,0,0,{"$f":"IF($BQ28=CQ$24,0.5*$BG28*$BN28*$BO28,0)+IF(AND($BX28=CQ$24,$E28>0),($BG28-$BH28)*$BU28*$BV28/$BG28,0)+IF($CE28=CQ$24,0.5*$BI28*$CB28*$CC28,0)+IF(AND($CL28=CQ$24,$I28>0),($BI28-$BJ28)*$CI28*$CJ28/$BI28,0)","v":0},0,0,0,0,12.681442349488126,0,0,0,0,0,0,0,25.362884698976252,0,0,0,0,0,0,5.7024079199999997,12.681442349488126,0,0,0,0,0,0,5.7024079199999997,31.065292618976251]
[null,"2. sal",10,0,8.4,"F3","L0",0,6,"F3","L0",0,43.428051699999997,221.90918656573439,31.020051699999996,36.498000000000005,{"$f":"IF($BL$34=1,\"-\",P28+Q28+R28+$U$6*$O$6*(C30+D30))","v":209.22754285714288},26.070000000000004,{"$f":"IF(BL34=1,\"-\",$Q$6*(0.5*E29*INDEX(fladelast,BK29,1)+IF(E29>0,INDEX(linielast,BR29,1)*(E29-H29)/E29)))","v":13.797000000000001},{"$f":"IF(BL34=1,\"-\",S28+T28+U28+$Q$6*C30)","v":114.36342857142857},{"$f":"IF(BL34=1,\"-\",$Q$6*(0.5*I29*INDEX(fladelast,BY29,1)+IF(I29>0,INDEX(linielast,CF29,1)*(I29-L29)/I29)))","v":9.8550000000000004},null,null,null,null,null,null,null,null,null,null,null,null,null,null,null,null,null,null,null,null,null,null,null,null,null,null,null,null,null,null,null,null,null,null,null,null,null,8.40001,0,6.0000099999999996,0,4,5.65,1.1000000000000001,2.5,1.6500000000000001,0.99,"B",1,0,1.1000000000000001,0,0,0,0,4,5.65,1.1000000000000001,2.5,1.6500000000000001,0.99,"B",1,0,1.1000000000000001,0,0,0,0,{"$f":"CM28+0.5*BG28*(BL28*BM28)+IF(E28>0,(BG28-BH28)*(BS28*BT28)/BG28)+0.5*BI28*(BZ28*CA28)+IF(I28>0,(BI28-BJ28)*(CG28*CH28)/BI28)+(C30+D30)*$U$6*$O$6","v":178.16245159727001},0,29.700041249999998,0,0,0,0,0,{"$f":"IF($BQ29=CU$24,0.5*$BG29*$BN29*$BO29,0)+IF(AND($BX29=CU$24,$E29>0),($BG29-$BH29)*$BU29*$BV29/$BG29,0)+IF($CE29=CU$24,0.5*$BI29*$CB29*$CC29,0)+IF(AND($CL29=CU$24,$I29>0),($BI29-$BJ29)*$CI29*$CJ29/$BI29,0)","v":0},0,17.820024750000002,0,0,0,0,0,0,38.044327048464382,0,0,0,0,{"$f":"MAX(DI28+DA28,DQ28+CS28)","v":0},0,5.7024079199999997,25.362884698976252,0,0,0,0,0,0,5.7024079199999997,43.746734968464381]
[null,"1. sal",10,0,8.4,"F4","L0",0,6,"F4","L0",0,78.078092950000013,307.35728996573437,55.770092950000006,78.078000000000017,{"$f":"IF($BL$34=1,\"-\",P29+Q29+R29+$U$6*$O$6*(C31+D31))","v":282.79554285714289},55.77,{"$f":"IF(BL34=1,\"-\",$Q$6*(0.5*E30*INDEX(fladelast,BK30,1)+IF(E30>0,INDEX(linielast,BR30,1)*(E30-H30)/E30)))","v":13.797000000000001},{"$f":"IF(BL34=1,\"-\",S29+T29+U29+$Q$6*C31)","v":147.01542857142857},{"$f":"IF(BL34=1,\"-\",$Q$6*(0.5*I30*INDEX(fladelast,BY30,1)+IF(I30>0,INDEX(linielast,CF30,1)*(I30-L30)/I30)))","v":9.8550000000000004},null,null,null,null,null,null,null,null,null,null,null,null,null,null,null,null,null,null,null,null,null,null,null,null,null,null,null,null,null,null,null,null,null,null,null,null,null,8.40001,0,6.0000099999999996,0,5,5.65,1.1000000000000001,7.5,1.6500000000000001,1.6500000000000001,"E",1,0,1.1000000000000001,0,0,0,0,5,5.65,1.1000000000000001,7.5,1.6500000000000001,1.6500000000000001,"E",1,0,1.1000000000000001,0,0,0,0,{"$f":"CM29+0.5*BG29*(BL29*BM29)+IF(E29>0,(BG29-BH29)*(BS29*BT29)/BG29)+0.5*BI29*(BZ29*CA29)+IF(I29>0,(BI29-BJ29)*(CG29*CH29)/BI29)+(C31+D31)*$U$6*$O$6","v":233.91051374727002},{"$f":"IF($BQ30=CN$24,0.5*$BG30*$BN30*$BO30,0)+IF(AND($BX30=CN$24,$E30>0),($BG30-$BH30)*$BU30*$BV30/$BG30,0)+IF($CE30=CN$24,0.5*$BI30*$CB30*$CC30,0)+IF(AND($CL30=CN$24,$I30>0),($BI30-$BJ30)*$CI30*$CJ30/$BI30,0)","v":0},0,0,0,89.100123750000009,0,0,0,0,0,0,0,89.100123750000009,0,0,0,38.044327048464382,29.700041249999998,0,0,0,0,0,5.7024079199999997,25.362884698976252,17.820024750000002,0,0,0,0,0,5.7024079199999997,73.446776218464379]
[null,"Stue",10,0,8.4,"F5","L0",0,6,"F5","L2",3,65.37307782500001,452.20547586573446,59.345098908298191,54.285000000000004,{"$f":"IF($BL$34=1,\"-\",P30+Q30+R30+$U$6*$O$6*(C32+D32))","v":427.6435428571429},48.125000000000007,{"$f":"IF(BL34=1,\"-\",$Q$6*(0.5*E31*INDEX(fladelast,BK31,1)+IF(E31>0,INDEX(linielast,BR31,1)*(E31-H31)/E31)))","v":15.687000000000003},{"$f":"IF(BL34=1,\"-\",S30+T30+U30+$Q$6*C32)","v":179.66742857142856},{"$f":"IF(BL34=1,\"-\",$Q$6*(0.5*I31*INDEX(fladelast,BY31,1)+IF(I31>0,INDEX(linielast,CF31,1)*(I31-L31)/I31)))","v":11.205000000000002},null,null,null,null,null,null,null,null,null,null,null,null,null,null,null,null,null,null,null,null,null,null,null,null,null,null,null,null,null,null,null,null,null,null,null,null,null,8.40001,0,6.0000099999999996,3,6,8.15,1.1000000000000001,4,1.6500000000000001,0.99,"D",1,0,1.1000000000000001,0,0,0,0,6,8.15,1.1000000000000001,4,1.6500000000000001,0.99,"D",3,8,1.1000000000000001,10,1.6500000000000001,0.99,"D",{"$f":"CM30+0.5*BG30*(BL30*BM30)+IF(E30>0,(BG30-BH30)*(BS30*BT30)/BG30)+0.5*BI30*(BZ30*CA30)+IF(I30>0,(BI30-BJ30)*(CG30*CH30)/BI30)+(C32+D32)*$U$6*$O$6","v":289.65857589727005},0,0,0,55.770079749977086,0,0,0,0,0,0,0,33.462047849986249,0,0,0,0,38.044327048464382,29.700041249999998,0,0,89.100123750000009,0,0,5.7024079199999997,25.362884698976252,17.820024750000002,0,0,89.100123750000009,0,0,5.7024079199999997,162.5468999684644]
[null,"Kld.",10,0,null,null,null,null,null,null,null,null,null,576.92365259903272,null,null,{"$f":"IF($BL$34=1,\"-\",P31+Q31+R31)","v":530.05354285714293},null,null,{"$f":"IF(BL34=1,\"-\",S31+T31+U31)","v":206.55942857142858},null,null,null,null,null,null,null,null,null,null,null,null,null,null,null,null,null,null,null,null,null,null,null,null,null,null,null,null,null,null,null,null,null,null,null,null,null,null,null,null,null,null,null,null,null,null,null,null,null,null,null,null,null,null,null,null,null,null,null,null,null,null,null,null,null,null,null,null,null,null,{"$f":"CM31+0.5*BG31*(BL31*BM31)+IF(E31>0,(BG31-BH31)*(BS31*BT31)/BG31)+0.5*BI31*(BZ31*CA31)+IF(I31>0,(BI31-BJ31)*(CG31*CH31)/BI31)","v":358.60667288059119},0,0,0,0,0,0,0,0,0,0,0,0,0,0,0,0,38.044327048464382,29.700041249999998,0,55.770079749977086,89.100123750000009,0,0,5.7024079199999997,25.362884698976252,17.820024750000002,0,33.462047849986249,89.100123750000009,0,0,5.7024079199999997,218.3169797184415]
[null,"Vejledning:",null,"Betonelementbyggeriers statik",null,null,null,null,null,null,null,"Polyteknisk Forlag 2010 eller www.bef.dk"," NB:  Resultaterne skal altid kontrolleres af ansvarlig statiker"]
[null,null,null,null,null,null,null,null,null,null,null,null,null,null,null,null,null,null,null,null,null,null,null,null,null,null,null,null,null,null,null,null,null,null,null,null,null,null,null,null,null,null,null,null,null,null,null,null,null,null,null,null,null,null,null,null,null,null,"Fejltabel",null,null,null,null,{"$f":"IF(OR(BL35=1,BL36=1,BL38=1,BL39=1),1,0)","v":0},{"$f":"BM35&BM36&BM37&BM38&BM39&BM40&BM41&BM42&BM43&BM44&BM45&BM46","v":""}]
[null,null,null,null,null,null,null,null,null,null,null,null,null,null,null,null,null,null,null,null,null,null,null,null,null,null,null,null,null,null,null,null,null,null,null,null,null,null,null,null,null,null,null,null,null,null,null,null,null,null,null,null,null,null,null,null,null,null,"Programmet modtager ikke negative inddata !  ",null,null,null,null,{"$f":"IF(MIN(O6,Q6,U6,P11:T15,P20:T21,C27:D32,E26:E31,H26:H31,I26:I31,L26:L31)<0,1,0)","v":0},{"$f":"IF(BL35=0,\"\",BG35)","v":""}]
[null,null,null,null,null,null,null,null,null,null,null,null,null,null,null,null,null,null,null,null,null,null,null,null,null,null,null,null,null,null,null,null,null,null,null,null,null,null,null,null,null,null,null,null,null,null,null,null,null,null,null,null,null,null,null,null,null,null,"Linielast udenfor dækfelt !  ",null,null,null,null,{"$f":"IF(OR(H26>E26,H27>E27,H28>E28,H29>E29,H30>E30,H31>E31,L26>I26,L27>I27,L28>I28,L29>I29,L30>I30,L31>I31),1,0)","v":0},{"$f":"IF(BL36=0,\"\",BG36)","v":""}]
[null,null,null,null,null,null,null,null,null,null,null,null,null,null,null,null,null,null,null,null,null,null,null,null,null,null,null,null,null,null,null,null,null,null,null,null,null,null,null,null,null,null,null,null,null,null,null,null,null,null,null,null,null,null,null,null,null,null,"I kombination med lastkategori E bør lastreduktionsfaktoren for sne ændres",null,null,null,null,{"$f":"IF(AND(BQ10=1,MAX(BR11:BR17)=1),1,0)","v":0},{"$f":"IF(BL37=0,\"\",BG37)","v":""}]
[null,null,null,null,null,null,null,null,null,null,null,null,null,null,null,null,null,null,null,null,null,null,null,null,null,null,null,null,null,null,null,null,null,null,null,null,null,null,null,null,null,null,null,null,null,null,null,null,null,null,null,null,null,null,null,null,null,null,"Partialkoefficient på nyttelast mindst 1 !",null,null,null,null,{"$f":"IF(OR(S11<1,S12<1,S13<1,S14<1,S15<1,S20<1,S21<1),1,0)","v":0},{"$f":"IF(BL38=0,\"\",BG38)","v":""}]
[null,null,null,null,null,null,null,null,null,null,null,null,null,null,null,null,null,null,null,null,null,null,null,null,null,null,null,null,null,null,null,null,null,null,null,null,null,null,null,null,null,null,null,null,null,null,null,null,null,null,null,null,null,null,null,null,null,null,"Reduktionsfaktor højst 1 !",null,null,null,null,{"$f":"IF(OR(T11>1,T12>1,T13>1,T14>1,T15>1,T20>1,T21>1),1,0)","v":0},{"$f":"IF(BL39=0,\"\",BG39)","v":""}]

{"sheet":"Brand","index":1,"n_rows":62,"n_cols":124,"rows_kept":62,"cut":false,"hidden":false,"merged":[[22,4,22,7],[22,12,22,14],[22,18,22,20],[22,2,22,3],[22,8,22,11],[22,15,22,17],[2,10,2,11],[3,10,3,11],[2,3,2,8],[3,3,3,8],[5,15,6,15],[2,12,3,20],[4,12,4,20],[61,59,61,60],[59,59,59,60],[49,59,49,60],[51,59,51,60],[52,59,52,60],[53,59,53,60],[54,59,54,60],[55,59,55,60],[60,59,60,60],[22,58,22,61],[22,62,22,68],[5,12,6,13],[5,14,6,14],[5,20,6,20],[5,17,6,19],[22,83,22,89],[20,13,20,14],[13,13,13,14],[14,13,14,14],[18,13,18,14],[19,13,19,14],[8,13,8,14],[22,69,22,75],[22,76,22,82],[5,16,6,16],[10,13,10,14],[11,13,11,14],[12,13,12,14],[22,115,22,122],[8,58,8,60],[22,91,22,98],[22,99,22,106],[22,107,22,114]]}
[]
[null,null,null,null,null,null,null,null,null,null,null,null,{"$f":"Kold!M2","v":"Lastnedføring version 3.0"},null,null,null,null,null,null,null,{"$f":"Kold!U2","v":"Udgivet af Betonelement-Foreningen juni 2012"}]
[null,"Sag:",null,{"$f":"Kold!D3","v":"Betonelementhuset"},null,null,null,null,null,"Nr.:",{"$f":"Kold!K3","v":"23 - 4545"},null,{"$f":"BM34","v":""}]
[null,"Emne:",null,{"$f":"Kold!D4","v":"Linie B, modul 5-12."},null,null,null,null,null,"Init:",{"$f":"Kold!K4","v":"JFJ"}]
[null,null,null,"Branddimensioneringstilstande"]
[null,null,null,null,null,null,null,null,null,null,null,null," Egenvægt, gg,sup =",null,1,"gg,inf  =",1," Konsekvensklasse:  KFI =",null,null,1]
[]
[null,null,null,null,null,null,null,null,null,null,null,null," Fladelaste",null,null,"gk","gfri,k","qk","y1","y2","Kategori"]
[null,null,null,null,null,null,null,null,null,null,null,null,null,null,null,"(kN/m2)","(kN/m2)","(kN/m2)",null,null,null,null,null,null,null,null,null,null,null,null,null,null,null,null,null,null,null,null,null,null,null,null,null,null,null,null,null,null,null,null,null,null,null,null,null,null,null,null,"Lastkategorier",null,null,"y0","y1","y2"]
[null,null,null,null,null,null,null,null,null,null,null,null,"F0",null,null,0,0,0,null,null,null,null,null,null,null,null,null,null,null,null,null,null,null,null,null,null,null,null,null,null,null,null,null,null,null,null,null,null,null,null,null,null,null,null,null,null,null,null,"A",null,null,1,2,3]
[null,null,null,null,null,null,null,null,null,null,null,null,{"$f":"BG52","v":"F1"},"Tagflade, sne",0,3.1,1,0.8,0.2,0,{"$f":"BO52","v":"N"},null,null,null,null,null,null,null,null,null,null,null,null,null,null,null,null,null,null,null,null,null,null,null,null,null,null,null,null,null,null,null,null,null,null,null,null,null,"B","F1",{"$f":"Kold!BI11","v":8},{"$f":"INDEX(psi,$BI11,BJ$10)","v":0.6},0.2,0]
[null,null,null,null,null,null,null,null," L1 og L2 betegner linielaste.",null,null,null,"F2","Boligarealer",0,3.65,1.5,1.5,0.3,0.2,{"$f":"BO53","v":"A"},null,null,null,null,null,null,null,null,null,null,null,null,null,null,null,null,null,null,null,null,null,null,null,null,null,null,null,null,null,null,null,null,null,null,null,null,null,"C","F2",{"$f":"Kold!BI12","v":1},0.5,0.3,0.2]
[null,null,null,null,null,null,null,null," Lv og Lh er dækkenes spændvidder.",null,null,null,"F3","Kontorer",0,3.65,2,2.5,0.4,0.2,{"$f":"BO54","v":"B"},null,null,null,null,null,null,null,null,null,null,null,null,null,null,null,null,null,null,null,null,null,null,null,null,null,null,null,null,null,null,null,null,null,null,null,null,null,"D","F3",{"$f":"Kold!BI13","v":2},0.6,0.4,0.2]
[null,null,null,null,null,null,null,null," Resultanter på underliggende væg",null,null,null,"F4","Kontor med arkiv",0,3.65,2,7.5,0.8,0.7,{"$f":"BO55","v":"E"},null,null,null,null,null,null,null,null,null,null,null,null,null,null,null,null,null,null,null,null,null,null,null,null,null,null,null,null,null,null,null,null,null,null,null,null,null,"E","F4",{"$f":"Kold!BI14","v":5},1,0.8,0.7]
[null,null,null,null,null,null,null,null,"eller bjælke:",null,null,null,{"$f":"BG56","v":"F5"},"Butiksarealer",0,4.1500000000000004,4,4,0.6,0.5,{"$f":"BO56","v":"D"},null,null,null,null,null,null,null,null,null,null,null,null,null,null,null,null,null,null,null,null,null,null,null,null,null,null,null,null,null,null,null,null,null,null,null,null,null,"F","F5",{"$f":"Kold!BI15","v":4},0.6,0.6,0.5]
[null,null,null,null,null,null,null,null,null,null,null,null,null,null,null,null,null,null,null,null,null,null,null,null,null,null,null,null,null,null,null,null,null,null,null,null,null,null,null,null,null,null,null,null,null,null,null,null,null,null,null,null,null,null,null,null,null,null,"G","L1",{"$f":"Kold!BI16","v":1},0.5,0.3,0.2]
[null,null,null,null,null,null,null,null,null,null,null,null,"Linielaste",null,null,"gk","gfri,k","qk","y1","y2","Kategori",null,null,null,null,null,null,null,null,null,null,null,null,null,null,null,null,null,null,null,null,null,null,null,null,null,null,null,null,null,null,null,null,null,null,null,null,null,"N","L2",{"$f":"Kold!BI17","v":4},0.6,0.6,0.5]
[null,null,null,null,null,null,null,null,null,null,null,null,null,null,null,"(kN/m)","(kN/m)","(kN/m)"]
[null,null,null,null,null,null,null,null,null,null,null,null,"L0",null,null,0,0,0]
[null,null,null,null,null,null,null,null," nv og nh : Laste fra dæk i etagen",null,null,null,{"$f":"BG61","v":"L1"},"Badeværelser",0,8,4,6,0.3,0.2,{"$f":"BO61","v":"A"}]
[null,null,null,null,null,null,null,null," no : Last fra højereliggende dæk og",null,null,null,{"$f":"BG62","v":"L2"},"Komprimator",0,0,8,10,0.6,0.5,{"$f":"BO62","v":"D"}]
[null,null,null,null,null,null,null,null," fra egenvægte i bærelinie"]
[null,"Etage","Egenvægt i bærelinie",null,"Laste på venstre dækfelt",null,null,null,"Laste på højre dækfelt",null,null,null,"maksimalværdier",null,null,"reducerede værdier",null,null,"minimalværdier",null,null,null,null,null,null,null,null,null,null,null,null,null,null,null,null,null,null,null,null,null,null,null,null,null,null,null,null,null,null,null,null,null,null,null,null,null,null,null,"Spændvidder",null,null,null,"Fladelaste, venstre dækfelt",null,null,null,null,null,null,"Linielaste, venstre dækfelt",null,null,null,null,null,null,"Fladelaste, højre dækfelt",null,null,null,null,null,null,"Linielaste, højre dækfelt",null,null,null,null,null,null,"Ng","DNmax (q)",null,null,null,null,null,null,null,"DNsædv (q)",null,null,null,null,null,null,null,"Nmax (q)",null,null,null,null,null,null,null,"Nsædv (q)",null,null,null,null,null,null,null,"No (q)"]
[null,null,"gk","gfri,k","Lv","Fladelast","Linielast","sv","Lh","Fladelast","Linielast","sh","nv","no","nh","nv","no","nh","nv","no","nh",null,null,null,null,null,null,null,null,null,null,null,null,null,null,null,null,null,null,null,null,null,null,null,null,null,null,null,null,null,null,null,null,null,null,null,null,null,"Lv","sv","Lh","sh",null,"gk","gg","qk","yq1","yq2","Kategori",null,"gk","gg","qk","yq1","yq2","Kategori",null,"gk","gg","qk","yq1","yq2","Kategori",null,"gk","gg","qk","yq1","yq2","Kategori",null,"A","B","C","D","E","F","G","N","A","B","C","D","E","F","G","N","A","B","C","D","E","F","G","N","A","B","C","D","E","F","G","N"]
[null,null,"(kN/m)","(kN/m)","(m)",null,null,"(m)","(m)",null,null,"(m)","(kN/m)","(kN/m)","(kN/m)","(kN/m)","(kN/m)","(kN/m)","(kN/m)","(kN/m)","(kN/m)"]
[null,{"$f":"Kold!B26","v":"Tag"},null,null,{"$f":"Kold!E26","v":8.4},{"$f":"INDEX($BG$51:$BG$56,BK26,1)","v":"F1"},{"$f":"INDEX($BG$60:$BG$62,BR26,1)","v":"L0"},{"$f":"Kold!H26","v":0},{"$f":"Kold!I26","v":6},{"$f":"INDEX($BG$51:$BG$56,BY26,1)","v":"F1"},{"$f":"INDEX($BG$60:$BG$62,CF26,1)","v":"L0"},{"$f":"Kold!L26","v":0},{"$f":"IF($BL$34=1,\"-\",0.5*BG26*(BL26*BM26+BN26*BO26)+IF(E26>0,(BG26-BH26)*(BS26*BT26+BU26*BV26)/BG26,0))","v":17.8920213},{"$f":"IF($BL$34=1,\"-\",CM26+DT26)","v":10},{"$f":"IF($BL$34=1,\"-\",0.5*BI26*(BZ26*CA26+CB26*CC26)+IF(I26>0,(BI26-BJ26)*(CG26*CH26+CI26*CJ26)/BI26))","v":12.780021299999998},{"$f":"IF($BL$34=1,\"-\",$U$6*$O$6*(0.5*E26*(INDEX(fladelast,BK26,1)+INDEX(fladelast,BK26,2)+INDEX(fladelast,BK26,3)*INDEX(fladelast,BK26,5))+IF(E26>0,(INDEX(linielast,BR26,1)+INDEX(linielast,BR26,2)+INDEX(linielast,BR26,3)*INDEX(linielast,BR26,5))*(E26-H26)/E26,0)))","v":17.22},{"$f":"IF($BL$34=1,\"-\",$U$6*$O$6*(C27+D27))","v":10},{"$f":"IF($BL$34=1,\"-\",$U$6*$O$6*(0.5*I26*(INDEX(fladelast,BY26,1)+INDEX(fladelast,BY26,2)+INDEX(fladelast,BY26,3)*INDEX(fladelast,BY26,5))+IF(I26>0,(INDEX(linielast,CF26,1)+INDEX(linielast,CF26,2)+INDEX(linielast,CF26,3)*INDEX(linielast,CF26,5))*(I26-L26)/I26)))","v":12.299999999999999},{"$f":"IF(BL34=1,\"-\",$Q$6*(0.5*E26*INDEX(fladelast,BK26,1)+IF(E26>0,INDEX(linielast,BR26,1)*(E26-H26)/E26)))","v":13.020000000000001},{"$f":"IF(BL34=1,\"-\",$Q$6*C27)","v":10},{"$f":"IF(BL34=1,\"-\",$Q$6*(0.5*I26*INDEX(fladelast,BY26,1)+IF(I26>0,INDEX(linielast,CF26,1)*(I26-L26)/I26)))","v":9.3000000000000007},null,null,null,null,null,null,null,null,null,null,null,null,null,null,null,null,null,null,null,null,null,null,null,null,null,null,null,null,null,null,null,null,null,null,null,null,null,{"$f":"E26+0.00001","v":8.40001},{"$f":"H26","v":0},{"$f":"I26+0.00001","v":6.0000099999999996},{"$f":"L26","v":0},{"$f":"Kold!BK26","v":2},{"$f":"INDEX(fladelast,$BK26,1)+INDEX(fladelast,$BK26,2)","v":4.0999999999999996},{"$f":"$U$6*$O$6","v":1},{"$f":"INDEX(fladelast,$BK26,3)","v":0.8},{"$f":"$U$6*INDEX(fladelast,$BK26,4)","v":0.2},{"$f":"INDEX(fladelast,$BK26,5)","v":0},{"$f":"INDEX(fladelast,$BK26,6)","v":"N"},{"$f":"Kold!BR26","v":1},{"$f":"INDEX(linielast,$BR26,1)+INDEX(linielast,$BR26,2)","v":0},{"$f":"$U$6*$O$6","v":1},{"$f":"INDEX(linielast,$BR26,3)","v":0},{"$f":"$U$6*INDEX(linielast,$BR26,4)","v":0},{"$f":"INDEX(linielast,$BR26,5)","v":0},{"$f":"INDEX(linielast,$BR26,6)","v":0},{"$f":"Kold!BY26","v":2},{"$f":"INDEX(fladelast,$BY26,1)+INDEX(fladelast,$BY26,2)","v":4.0999999999999996},{"$f":"$U$6*$O$6","v":1},{"$f":"INDEX(fladelast,$BY26,3)","v":0.8},{"$f":"$U$6*INDEX(fladelast,$BY26,4)","v":0.2},{"$f":"INDEX(fladelast,$BY26,5)","v":0},{"$f":"INDEX(fladelast,$BY26,6)","v":"N"},{"$f":"Kold!CF26","v":1},{"$f":"INDEX(linielast,$CF26,1)+INDEX(linielast,$CF26,2)","v":0},{"$f":"$U$6*$O$6","v":1},{"$f":"INDEX(linielast,$CF26,3)","v":0},{"$f":"$U$6*INDEX(linielast,$CF26,4)","v":0},{"$f":"INDEX(linielast,$CF26,5)","v":0},{"$f":"INDEX(linielast,$CF26,6)","v":0},{"$f":"(C27+D27)*$U$6*$O$6","v":10},{"$f":"IF($BQ26=CN$24,0.5*$BG26*$BN26*$BO26,0)+IF(AND($BX26=CN$24,$E26>0),($BG26-$BH26)*$BU26*$BV26/$BG26,0)+IF($CE26=CN$24,0.5*$BI26*$CB26*$CC26,0)+IF(AND($CL26=CN$24,$I26>0),($BI26-$BJ26)*$CI26*$CJ26/$BI26,0)","v":0},0,0,0,0,0,0,1.1520016000000002,{"$f":"IF($BQ26=CV$24,0.5*$BG26*$BN26*$BP26,0)+IF(AND($BX26=CV$24,$E26>0),($BG26-$BH26)*$BU26*$BW26/$BG26,0)+IF($CE26=CV$24,0.5*$BI26*$CB26*$CD26,0)+IF(AND($CL26=CV$24,$I26>0),($BI26-$BJ26)*$CI26*$CK26/$BI26,0)","v":0},0,0,0,0,0,0,0,0,0,0,0,0,0,0,0,0,0,0,0,0,0,0,0,{"$f":"IF(DK26>DS26,DK26+SUM(DL26:DR26),DS26+SUM(DD26:DJ26))","v":0}]
[null,{"$f":"Kold!B27","v":"4. sal"},{"$f":"Kold!C27","v":10},{"$f":"Kold!D27","v":0},{"$f":"Kold!E27","v":8.4},"F2","L1",{"$f":"Kold!H27","v":2},{"$f":"Kold!I27","v":6},"F2","L0",{"$f":"Kold!L27","v":0},34.034317625845688,{"$f":"IF($BL$34=1,\"-\",CM27+DT27)","v":50.67204259999999},16.800028000000001,32.947142857142858,{"$f":"IF($BL$34=1,\"-\",P26+Q26+R26+$U$6*$O$6*(C28+D28))","v":49.519999999999996},16.350000000000001,{"$f":"IF(BL34=1,\"-\",$Q$6*(0.5*E27*INDEX(fladelast,BK27,1)+IF(E27>0,INDEX(linielast,BR27,1)*(E27-H27)/E27)))","v":21.425238095238093},{"$f":"IF(BL34=1,\"-\",S26+T26+U26+$Q$6*C28)","v":42.320000000000007},{"$f":"IF(BL34=1,\"-\",$Q$6*(0.5*I27*INDEX(fladelast,BY27,1)+IF(I27>0,INDEX(linielast,CF27,1)*(I27-L27)/I27)))","v":10.95},null,null,null,null,null,null,null,null,null,null,null,null,null,null,null,null,null,null,null,null,null,null,null,null,null,null,null,null,null,null,null,null,null,null,null,null,null,8.40001,2,6.0000099999999996,0,{"$f":"Kold!BK27","v":3},5.15,1,1.5,0.3,0.2,"A",{"$f":"Kold!BR27","v":2},12,1,6,0.3,0.2,"A",{"$f":"Kold!BY27","v":3},5.15,1,1.5,0.3,0.2,"A",{"$f":"Kold!CF27","v":1},0,1,0,0,0,0,{"$f":"CM26+0.5*BG26*(BL26*BM26)+IF(E26>0,(BG26-BH26)*(BS26*BT26)/BG26)+0.5*BI26*(BZ26*CA26)+IF(I26>0,(BI26-BJ26)*(CG26*CH26)/BI26)+(C28+D28)*$U$6*$O$6","v":49.520040999999992},4.6114335816320455,0,0,0,0,0,0,0,3.0742890544213637,0,0,0,0,0,0,0,{"$f":"MAX(DD26+CV26,DL26+CN26)","v":0},0,0,0,0,0,0,{"$f":"IF(DK26+CU26-DS27>SUM(DD27:DJ27)-SUM(DL27:DR27),DK26+CU26,DS27)","v":1.1520016000000002},{"$f":"DL26+CV26","v":0},0,0,0,0,0,0,0,{"$f":"IF(DK27>DS27,DK27+SUM(DL27:DR27),DS27+SUM(DD27:DJ27))","v":1.1520016000000002}]
[null,{"$f":"Kold!B28","v":"3. sal"},{"$f":"Kold!C28","v":10},{"$f":"Kold!D28","v":0},{"$f":"Kold!E28","v":8.4},"F2","L1",{"$f":"Kold!H28","v":2},{"$f":"Kold!I28","v":6},"F2","L0",{"$f":"Kold!L28","v":0},34.034317625845688,110.35438662584566,16.800028000000001,32.947142857142858,{"$f":"IF($BL$34=1,\"-\",P27+Q27+R27+$U$6*$O$6*(C29+D29))","v":108.81714285714284},16.350000000000001,{"$f":"IF(BL34=1,\"-\",$Q$6*(0.5*E28*INDEX(fladelast,BK28,1)+IF(E28>0,INDEX(linielast,BR28,1)*(E28-H28)/E28)))","v":21.425238095238093},{"$f":"IF(BL34=1,\"-\",S27+T27+U27+$Q$6*C29)","v":84.695238095238096},{"$f":"IF(BL34=1,\"-\",$Q$6*(0.5*I28*INDEX(fladelast,BY28,1)+IF(I28>0,INDEX(linielast,CF28,1)*(I28-L28)/I28)))","v":10.95},null,null,null,null,null,null,null,null,null,null,null,null,null,null,null,null,null,null,null,null,null,null,null,null,null,null,null,null,null,null,null,null,null,null,null,null,null,8.40001,2,6.0000099999999996,0,{"$f":"Kold!BK28","v":3},5.15,1,1.5,0.3,0.2,"A",{"$f":"Kold!BR28","v":2},12,1,6,0.3,0.2,"A",{"$f":"Kold!BY28","v":3},5.15,1,1.5,0.3,0.2,"A",{"$f":"Kold!CF28","v":1},0,1,0,0,0,0,{"$f":"CM27+0.5*BG27*(BL27*BM27)+IF(E27>0,(BG27-BH27)*(BS27*BT27)/BG27)+0.5*BI27*(BZ27*CA27)+IF(I27>0,(BI27-BJ27)*(CG27*CH27)/BI27)+(C29+D29)*$U$6*$O$6","v":105.74295304421362},4.6114335816320455,0,0,0,0,0,0,0,3.0742890544213637,0,0,0,0,0,0,0,4.6114335816320455,0,0,0,0,0,0,0,3.0742890544213637,0,0,0,0,0,0,0,4.6114335816320455]
[null,{"$f":"Kold!B29","v":"2. sal"},{"$f":"Kold!C29","v":10},{"$f":"Kold!D29","v":0},{"$f":"Kold!E29","v":8.4},"F3","L0",{"$f":"Kold!H29","v":0},{"$f":"Kold!I29","v":6},"F3","L0",{"$f":"Kold!L29","v":0},27.930033250000001,169.65158772448069,19.950033250000001,25.830000000000002,{"$f":"IF($BL$34=1,\"-\",P28+Q28+R28+$U$6*$O$6*(C30+D30))","v":168.1142857142857},18.450000000000003,{"$f":"IF(BL34=1,\"-\",$Q$6*(0.5*E29*INDEX(fladelast,BK29,1)+IF(E29>0,INDEX(linielast,BR29,1)*(E29-H29)/E29)))","v":15.33},{"$f":"IF(BL34=1,\"-\",S28+T28+U28+$Q$6*C30)","v":127.07047619047619},{"$f":"IF(BL34=1,\"-\",$Q$6*(0.5*I29*INDEX(fladelast,BY29,1)+IF(I29>0,INDEX(linielast,CF29,1)*(I29-L29)/I29)))","v":10.95},null,null,null,null,null,null,null,null,null,null,null,null,null,null,null,null,null,null,null,null,null,null,null,null,null,null,null,null,null,null,null,null,null,null,null,null,null,8.40001,0,6.0000099999999996,0,{"$f":"Kold!BK29","v":4},5.65,1,2.5,0.4,0.2,"B",{"$f":"Kold!BR29","v":1},0,1,0,0,0,0,{"$f":"Kold!BY29","v":4},5.65,1,2.5,0.4,0.2,"B",{"$f":"Kold!CF29","v":1},0,1,0,0,0,0,{"$f":"CM28+0.5*BG28*(BL28*BM28)+IF(E28>0,(BG28-BH28)*(BS28*BT28)/BG28)+0.5*BI28*(BZ28*CA28)+IF(I28>0,(BI28-BJ28)*(CG28*CH28)/BI28)+(C30+D30)*$U$6*$O$6","v":161.96586508842728},0,7.2000099999999998,0,0,0,0,0,0,0,3.6000049999999999,0,0,0,0,0,0,7.6857226360534092,0,0,0,0,0,0,0,6.1485781088427274,0,0,0,0,0,0,0,7.6857226360534092]
[null,{"$f":"Kold!B30","v":"1. sal"},{"$f":"Kold!C30","v":10},{"$f":"Kold!D30","v":0},{"$f":"Kold!E30","v":8.4},"F4","L0",{"$f":"Kold!H30","v":0},{"$f":"Kold!I30","v":6},"F4","L0",{"$f":"Kold!L30","v":0},48.930058250000002,227.53165422448069,34.950058249999998,45.78,{"$f":"IF($BL$34=1,\"-\",P29+Q29+R29+$U$6*$O$6*(C31+D31))","v":222.39428571428573},32.700000000000003,{"$f":"IF(BL34=1,\"-\",$Q$6*(0.5*E30*INDEX(fladelast,BK30,1)+IF(E30>0,INDEX(linielast,BR30,1)*(E30-H30)/E30)))","v":15.33},{"$f":"IF(BL34=1,\"-\",S29+T29+U29+$Q$6*C31)","v":163.35047619047617},{"$f":"IF(BL34=1,\"-\",$Q$6*(0.5*I30*INDEX(fladelast,BY30,1)+IF(I30>0,INDEX(linielast,CF30,1)*(I30-L30)/I30)))","v":10.95},null,null,null,null,null,null,null,null,null,null,null,null,null,null,null,null,null,null,null,null,null,null,null,null,null,null,null,null,null,null,null,null,null,null,null,null,null,8.40001,0,6.0000099999999996,0,{"$f":"Kold!BK30","v":5},5.65,1,7.5,0.8,0.7,"E",{"$f":"Kold!BR30","v":1},0,1,0,0,0,0,{"$f":"Kold!BY30","v":5},5.65,1,7.5,0.8,0.7,"E",{"$f":"Kold!CF30","v":1},0,1,0,0,0,0,{"$f":"CM29+0.5*BG29*(BL29*BM29)+IF(E29>0,(BG29-BH29)*(BS29*BT29)/BG29)+0.5*BI29*(BZ29*CA29)+IF(I29>0,(BI29-BJ29)*(CG29*CH29)/BI29)+(C31+D31)*$U$6*$O$6","v":212.64592158842729},0,0,0,0,43.200060000000001,0,0,0,0,0,0,0,37.800052499999993,0,0,0,7.6857226360534092,7.2000099999999998,0,0,0,0,0,0,6.1485781088427274,3.6000049999999999,0,0,0,0,0,0,14.885732636053408]
[null,{"$f":"Kold!B31","v":"Stue"},{"$f":"Kold!C31","v":10},{"$f":"Kold!D31","v":0},{"$f":"Kold!E31","v":8.4},"F5","L0",{"$f":"Kold!H31","v":0},{"$f":"Kold!I31","v":6},"F5","L2",{"$f":"Kold!L31","v":3},44.310052750000004,321.41177072448068,38.650064416647226,42.63,{"$f":"IF($BL$34=1,\"-\",P30+Q30+R30+$U$6*$O$6*(C32+D32))","v":310.87428571428569},36.950000000000003,{"$f":"IF(BL34=1,\"-\",$Q$6*(0.5*E31*INDEX(fladelast,BK31,1)+IF(E31>0,INDEX(linielast,BR31,1)*(E31-H31)/E31)))","v":17.430000000000003},{"$f":"IF(BL34=1,\"-\",S30+T30+U30+$Q$6*C32)","v":199.63047619047617},{"$f":"IF(BL34=1,\"-\",$Q$6*(0.5*I31*INDEX(fladelast,BY31,1)+IF(I31>0,INDEX(linielast,CF31,1)*(I31-L31)/I31)))","v":12.450000000000001},null,null,null,null,null,null,null,null,null,null,null,null,null,null,null,null,null,null,null,null,null,null,null,null,null,null,null,null,null,null,null,null,null,null,null,null,null,8.40001,0,6.0000099999999996,3,{"$f":"Kold!BK31","v":6},8.15,1,4,0.6,0.5,"D",{"$f":"Kold!BR31","v":1},0,1,0,0,0,0,{"$f":"Kold!BY31","v":6},8.15,1,4,0.6,0.5,"D",{"$f":"Kold!CF31","v":3},8,1,10,0.6,0.5,"D",{"$f":"CM30+0.5*BG30*(BL30*BM30)+IF(E30>0,(BG30-BH30)*(BS30*BT30)/BG30)+0.5*BI30*(BZ30*CA30)+IF(I30>0,(BI30-BJ30)*(CG30*CH30)/BI30)+(C32+D32)*$U$6*$O$6","v":263.32597808842729},0,0,0,20.280028999991664,0,0,0,0,0,0,0,16.900024166659723,0,0,0,0,7.6857226360534092,7.2000099999999998,0,0,43.200060000000001,0,0,0,6.1485781088427274,3.6000049999999999,0,0,37.800052499999993,0,0,0,58.085792636053412]
[null,{"$f":"Kold!B32","v":"Kld."},{"$f":"Kold!C32","v":10},{"$f":"Kold!D32","v":0},null,null,null,null,null,null,null,null,null,404.37188789112793,null,null,{"$f":"IF($BL$34=1,\"-\",P31+Q31+R31)","v":390.45428571428567},null,null,{"$f":"IF(BL34=1,\"-\",S31+T31+U31)","v":229.51047619047617},null,null,null,null,null,null,null,null,null,null,null,null,null,null,null,null,null,null,null,null,null,null,null,null,null,null,null,null,null,null,null,null,null,null,null,null,null,null,null,null,null,null,null,null,null,null,null,null,null,null,null,null,null,null,null,null,null,null,null,null,null,null,null,null,null,null,null,null,null,null,{"$f":"CM31+0.5*BG31*(BL31*BM31)+IF(E31>0,(BG31-BH31)*(BS31*BT31)/BG31)+0.5*BI31*(BZ31*CA31)+IF(I31>0,(BI31-BJ31)*(CG31*CH31)/BI31)","v":326.00606625508289},0,0,0,0,0,0,0,0,0,0,0,0,0,0,0,0,7.6857226360534092,7.2000099999999998,0,20.280028999991664,43.200060000000001,0,0,0,6.1485781088427274,3.6000049999999999,0,16.900024166659723,37.800052499999993,0,0,0,78.365821636045069]
[null,"Vejledning:",null,"Betonelementbyggeriers statik",null,null,null,null,null,null,null,"Polyteknisk Forlag 2010 eller www.bef.dk"," NB:  Resultaterne skal altid kontrolleres af ansvarlig statiker"]
[null,null,null,null,null,null,null,null,null,null,null,null,null,null,null,null,null,null,null,null,null,null,null,null,null,null,null,null,null,null,null,null,null,null,null,null,null,null,null,null,null,null,null,null,null,null,null,null,null,null,null,null,null,null,null,null,null,null,"Fejltabel",null,null,null,null,{"$f":"IF(MAX(BL35:BL46)=1,1,0)","v":0},{"$f":"BM35&BM36&BM37&BM38&BM39&BM40&BM41&BM42&BM43&BM44&BM45&BM46","v":""}]
[null,null,null,null,null,null,null,null,null,null,null,null,null,null,null,null,null,null,null,null,null,null,null,null,null,null,null,null,null,null,null,null,null,null,null,null,null,null,null,null,null,null,null,null,null,null,null,null,null,null,null,null,null,null,null,null,null,null,"Programmet modtager ikke negative inddata !  ",null,null,null,null,{"$f":"IF(MIN(O6,Q6,U6,BJ52:BN56,BJ61:BN62,C27:D32,E26:E31,H26:H31,I26:I31,L26:L31)<0,1,0)","v":0},{"$f":"IF(BL35=0,\"\",BG35)","v":""}]
[null,null,null,null,null,null,null,null,null,null,null,null,null,null,null,null,null,null,null,null,null,null,null,null,null,null,null,null,null,null,null,null,null,null,null,null,null,null,null,null,null,null,null,null,null,null,null,null,null,null,null,null,null,null,null,null,null,null,"Linielast udenfor dækfelt !  ",null,null,null,null,{"$f":"IF(OR(H26>E26,H27>E27,H28>E28,H29>E29,H30>E30,H31>E31,L26>I26,L27>I27,L28>I28,L29>I29,L30>I30,L31>I31),1,0)","v":0},{"$f":"IF(BL36=0,\"\",BG36)","v":""}]
[null,null,null,null,null,null,null,null,null,null,null,null,null,null,null,null,null,null,null,null,null,null,null,null,null,null,null,null,null,null,null,null,null,null,null,null,null,null,null,null,null,null,null,null,null,null,null,null,null,null,null,null,null,null,null,null,null,null,"Primær reduktionsfaktor skal være størst !",null,null,null,null,{"$f":"IF(OR(T11>S11,T12>S12,T13>S13,T14>S14,T15>S15,T20>S20,T21>S21),1,0)","v":0},{"$f":"IF(BL37=0,\"\",BG37)","v":""}]
[]
[]
[]
[]
[]
[]
[]
[]
[]
[]
[]
[null,null,null,null,null,null,null,null,null,null,null,null,null,null,null,null,null,null,null,null,null,null,null,null,null,null,null,null,null,null,null,null,null,null,null,null,null,null,null,null,null,null,null,null,null,null,null,null,null,null,null,null,null,null,null,null,null,null," Fladelaste",null,null,"gk","gfri,k","qk","yq1/yq2","yq2","Kategori"]
[null,null,null,null,null,null,null,null,null,null,null,null,null,null,null,null,null,null,null,null,null,null,null,null,null,null,null,null,null,null,null,null,null,null,null,null,null,null,null,null,null,null,null,null,null,null,null,null,null,null,null,null,null,null,null,null,null,null,null,null,null,"(kN/m2)","(kN/m2)","(kN/m2)"]
[null,null,null,null,null,null,null,null,null,null,null,null,null,null,null,null,null,null,null,null,null,null,null,null,null,null,null,null,null,null,null,null,null,null,null,null,null,null,null,null,null,null,null,null,null,null,null,null,null,null,null,null,null,null,null,null,null,null,"F0",null,null,0,0,0]
[null,null,null,null,null,null,null,null,null,null,null,null,null,null,null,null,null,null,null,null,null,null,null,null,null,null,null,null,null,null,null,null,null,null,null,null,null,null,null,null,null,null,null,null,null,null,null,null,null,null,null,null,null,null,null,null,null,null,{"$f":"Kold!M11","v":"F1"},{"$f":"Kold!N11","v":"Tagflade, sne"},{"$f":"Kold!O11","v":0},{"$f":"Kold!P11","v":3.1},{"$f":"Kold!Q11","v":1},{"$f":"Kold!R11","v":0.8},{"$f":"S11","v":0.2},0,{"$f":"INDEX($BG$10:$BG$17,BI11,1)","v":"N"}]
[null,null,null,null,null,null,null,null,null,null,null,null,null,null,null,null,null,null,null,null,null,null,null,null,null,null,null,null,null,null,null,null,null,null,null,null,null,null,null,null,null,null,null,null,null,null,null,null,null,null,null,null,null,null,null,null,null,null,{"$f":"Kold!M12","v":"F2"},{"$f":"Kold!N12","v":"Boligarealer"},{"$f":"Kold!O12","v":0},{"$f":"Kold!P12","v":3.65},{"$f":"Kold!Q12","v":1.5},{"$f":"Kold!R12","v":1.5},0.3,0.2,{"$f":"INDEX($BG$10:$BG$17,BI12,1)","v":"A"}]
[null,null,null,null,null,null,null,null,null,null,null,null,null,null,null,null,null,null,null,null,null,null,null,null,null,null,null,null,null,null,null,null,null,null,null,null,null,null,null,null,null,null,null,null,null,null,null,null,null,null,null,null,null,null,null,null,null,null,{"$f":"Kold!M13","v":"F3"},{"$f":"Kold!N13","v":"Kontorer"},{"$f":"Kold!O13","v":0},{"$f":"Kold!P13","v":3.65},{"$f":"Kold!Q13","v":2},{"$f":"Kold!R13","v":2.5},0.4,0.2,{"$f":"INDEX($BG$10:$BG$17,BI13,1)","v":"B"}]
[null,null,null,null,null,null,null,null,null,null,null,null,null,null,null,null,null,null,null,null,null,null,null,null,null,null,null,null,null,null,null,null,null,null,null,null,null,null,null,null,null,null,null,null,null,null,null,null,null,null,null,null,null,null,null,null,null,null,{"$f":"Kold!M14","v":"F4"},{"$f":"Kold!N14","v":"Kontor med arkiv"},{"$f":"Kold!O14","v":0},{"$f":"Kold!P14","v":3.65},{"$f":"Kold!Q14","v":2},{"$f":"Kold!R14","v":7.5},0.8,0.7,{"$f":"INDEX($BG$10:$BG$17,BI14,1)","v":"E"}]
[null,null,null,null,null,null,null,null,null,null,null,null,null,null,null,null,null,null,null,null,null,null,null,null,null,null,null,null,null,null,null,null,null,null,null,null,null,null,null,null,null,null,null,null,null,null,null,null,null,null,null,null,null,null,null,null,null,null,{"$f":"Kold!M15","v":"F5"},{"$f":"Kold!N15","v":"Butiksarealer"},{"$f":"Kold!O15","v":0},{"$f":"Kold!P15","v":4.1500000000000004},{"$f":"Kold!Q15","v":4},{"$f":"Kold!R15","v":4},0.6,0.5,{"$f":"INDEX($BG$10:$BG$17,BI15,1)","v":"D"}]
[]
[null,null,null,null,null,null,null,null,null,null,null,null,null,null,null,null,null,null,null,null,null,null,null,null,null,null,null,null,null,null,null,null,null,null,null,null,null,null,null,null,null,null,null,null,null,null,null,null,null,null,null,null,null,null,null,null,null,null,"Linielaste",null,null,"gk","gfri,k","qk","yq1/yq2","yq2","Kategori"]
[null,null,null,null,null,null,null,null,null,null,null,null,null,null,null,null,null,null,null,null,null,null,null,null,null,null,null,null,null,null,null,null,null,null,null,null,null,null,null,null,null,null,null,null,null,null,null,null,null,null,null,null,null,null,null,null,null,null,null,null,null,"(kN/m)","(kN/m)","(kN/m)"]
[null,null,null,null,null,null,null,null,null,null,null,null,null,null,null,null,null,null,null,null,null,null,null,null,null,null,null,null,null,null,null,null,null,null,null,null,null,null,null,null,null,null,null,null,null,null,null,null,null,null,null,null,null,null,null,null,null,null,"L0",null,null,0,0,0]
[null,null,null,null,null,null,null,null,null,null,null,null,null,null,null,null,null,null,null,null,null,null,null,null,null,null,null,null,null,null,null,null,null,null,null,null,null,null,null,null,null,null,null,null,null,null,null,null,null,null,null,null,null,null,null,null,null,null,{"$f":"Kold!M20","v":"L1"},{"$f":"Kold!N20","v":"Badeværelser"},{"$f":"Kold!O20","v":0},{"$f":"Kold!P20","v":8},{"$f":"Kold!Q20","v":4},{"$f":"Kold!R20","v":6},{"$f":"S20","v":0.3},{"$f":"T20","v":0.2},{"$f":"INDEX($BG$10:$BG$17,BI16,1)","v":"A"}]
[null,null,null,null,null,null,null,null,null,null,null,null,null,null,null,null,null,null,null,null,null,null,null,null,null,null,null,null,null,null,null,null,null,null,null,null,null,null,null,null,null,null,null,null,null,null,null,null,null,null,null,null,null,null,null,null,null,null,{"$f":"Kold!M21","v":"L2"},{"$f":"Kold!N21","v":"Komprimator"},{"$f":"Kold!O21","v":0},{"$f":"Kold!P21","v":0},{"$f":"Kold!Q21","v":8},{"$f":"Kold!R21","v":10},{"$f":"S21","v":0.6},{"$f":"T21","v":0.5},{"$f":"INDEX($BG$10:$BG$17,BI17,1)","v":"D"}]

{"sheet":"Ark1","index":2,"n_rows":28,"n_cols":47,"rows_kept":28,"cut":false,"hidden":false,"merged":[]}
[null,{"$f":"-Kold!BG26","v":-8.40001},0,0,{"$f":"Kold!BI26","v":6.0000099999999996},{"$f":"-Kold!BG27","v":-8.40001},0,{"$f":"Kold!BI27","v":6.0000099999999996},{"$f":"-Kold!BG28","v":-8.40001},0,{"$f":"Kold!BI28","v":6.0000099999999996},{"$f":"-Kold!BG29","v":-8.40001},0,{"$f":"Kold!BI29","v":6.0000099999999996},{"$f":"-Kold!BG30","v":-8.40001},0,{"$f":"Kold!BI30","v":6.0000099999999996},{"$f":"-Kold!BG31","v":-8.40001},0,{"$f":"Kold!BI31","v":6.0000099999999996},-1,0,1,{"$f":"-Kold!H26","v":0},{"$f":"X1","v":0},{"$f":"Kold!L26","v":0},{"$f":"Z1","v":0},{"$f":"-Kold!H27","v":-2},{"$f":"AB1","v":-2},{"$f":"Kold!L27","v":0},{"$f":"AD1","v":0},{"$f":"-Kold!H28","v":-2},{"$f":"AF1","v":-2},{"$f":"Kold!L28","v":0},{"$f":"AH1","v":0},{"$f":"-Kold!H29","v":0},{"$f":"AJ1","v":0},{"$f":"Kold!L29","v":0},{"$f":"AL1","v":0},{"$f":"-Kold!H30","v":0},{"$f":"AN1","v":0},{"$f":"Kold!L30","v":0},{"$f":"AP1","v":0},{"$f":"-Kold!H31","v":0},{"$f":"AR1","v":0},{"$f":"Kold!L31","v":3},{"$f":"AT1","v":3}]
["Geometri",null,0,{"$f":"IF(AND(Kold!$E$26=0,Kold!$I$26=0),G2,G2+3)","v":18},null,null,{"$f":"IF(AND(Kold!$E$27=0,Kold!$I$27=0),J2,J2+3)","v":15},null,null,{"$f":"IF(AND(Kold!$E$28=0,Kold!$I$28=0),M2,M2+3)","v":12},null,null,{"$f":"IF(AND(Kold!$E$29=0,Kold!$I$29=0),P2,P2+3)","v":9},null,null,{"$f":"IF(AND(Kold!$E$30=0,Kold!$I$30=0),S2,S2+3)","v":6},null,null,{"$f":"IF(AND(Kold!$E$31=0,Kold!$I$31=0),V2,V2+3)","v":3},null,null,0]
[{"$f":"Kold!B26&\"-v   \"&Kold!$F$26","v":"Tag-v   F1"},{"$f":"D2+IF(Kold!E26=0,100,0)","v":18},{"$f":"B3","v":18}]
[{"$f":"Kold!$J$26&\"   \"&Kold!B26&\"-h\"","v":"F1   Tag-h"},null,null,{"$f":"D2+IF(Kold!I26=0,100,0)","v":18},{"$f":"D4","v":18}]
[{"$f":"Kold!B27&\"-v   \"&Kold!$F$27","v":"4. sal-v   F2"},null,null,null,null,{"$f":"G2+IF(Kold!E27=0,100,0)","v":15},{"$f":"F5","v":15}]
[{"$f":"Kold!$J$27&\"   \"&Kold!B27&\"-h\"","v":"F2   4. sal-h"},null,null,null,null,null,{"$f":"G2+IF(Kold!I27=0,100,0)","v":15},{"$f":"G6","v":15}]
[{"$f":"Kold!B28&\"-v   \"&Kold!$F$28","v":"3. sal-v   F2"},null,null,null,null,null,null,null,{"$f":"J2+IF(Kold!E28=0,100,0)","v":12},{"$f":"I7","v":12}]
[{"$f":"Kold!$J$28&\"   \"&Kold!B28&\"-h\"","v":"F2   3. sal-h"},null,null,null,null,null,null,null,null,{"$f":"J2+IF(Kold!I28=0,100,0)","v":12},{"$f":"J8","v":12}]
[{"$f":"Kold!B29&\"-v   \"&Kold!$F$29","v":"2. sal-v   F3"},null,null,null,null,null,null,null,null,null,null,{"$f":"M2+IF(Kold!E29=0,100,0)","v":9},{"$f":"L9","v":9}]
[{"$f":"Kold!$J$29&\"   \"&Kold!B29&\"-h\"","v":"F3   2. sal-h"},null,null,null,null,null,null,null,null,null,null,null,{"$f":"M2+IF(Kold!I29=0,100,0)","v":9},{"$f":"M10","v":9}]
[{"$f":"Kold!B30&\"-v   \"&Kold!$F$30","v":"1. sal-v   F4"},null,null,null,null,null,null,null,null,null,null,null,null,null,{"$f":"P2+IF(Kold!E30=0,100,0)","v":6},{"$f":"O11","v":6}]
[{"$f":"Kold!$J$30&\"   \"&Kold!B30&\"-h\"","v":"F4   1. sal-h"},null,null,null,null,null,null,null,null,null,null,null,null,null,null,{"$f":"P2+IF(Kold!I30=0,100,0)","v":6},{"$f":"P12","v":6}]
[{"$f":"Kold!B31&\"-v   \"&Kold!$F$31","v":"Stue-v   F5"},null,null,null,null,null,null,null,null,null,null,null,null,null,null,null,null,{"$f":"S2+IF(Kold!E31=0,100,0)","v":3},{"$f":"R13","v":3}]
[{"$f":"Kold!$J$31&\"   \"&Kold!B31&\"-h\"","v":"F5   Stue-h"},null,null,null,null,null,null,null,null,null,null,null,null,null,null,null,null,null,{"$f":"S2+IF(Kold!I31=0,100,0)","v":3},{"$f":"S14","v":3}]
[{"$f":"Kold!B32","v":"Kld."},null,null,null,null,null,null,null,null,null,null,null,null,null,null,null,null,null,null,null,0,0]
[null,null,null,null,null,null,null,null,null,null,null,null,null,null,null,null,null,null,null,null,null,0,0]
[{"$f":"Kold!G26","v":"L0"},null,null,null,null,null,null,null,null,null,null,null,null,null,null,null,null,null,null,null,null,null,null,{"$f":"B3+IF(Kold!BR26=1,100,0)","v":118},{"$f":"X17+1","v":119}]
[{"$f":"Kold!K26","v":"L0"},null,null,null,null,null,null,null,null,null,null,null,null,null,null,null,null,null,null,null,null,null,null,null,null,{"$f":"D4+IF(Kold!CF26=1,100,0)","v":118},{"$f":"Z18+1","v":119}]
[{"$f":"Kold!G27","v":"L1"},null,null,null,null,null,null,null,null,null,null,null,null,null,null,null,null,null,null,null,null,null,null,null,null,null,null,{"$f":"F5+IF(Kold!BR27=1,100,0)","v":15},{"$f":"AB19+1","v":16}]
[{"$f":"Kold!K27","v":"L0"},null,null,null,null,null,null,null,null,null,null,null,null,null,null,null,null,null,null,null,null,null,null,null,null,null,null,null,null,{"$f":"G6+IF(Kold!CF27=1,100,0)","v":115},{"$f":"AD20+1","v":116}]
[{"$f":"Kold!G28","v":"L1"},null,null,null,null,null,null,null,null,null,null,null,null,null,null,null,null,null,null,null,null,null,null,null,null,null,null,null,null,null,null,{"$f":"I7+IF(Kold!BR28=1,100,0)","v":12},{"$f":"AF21+1","v":13}]
[{"$f":"Kold!K28","v":"L0"},null,null,null,null,null,null,null,null,null,null,null,null,null,null,null,null,null,null,null,null,null,null,null,null,null,null,null,null,null,null,null,null,{"$f":"J8+IF(Kold!CF28=1,100,0)","v":112},{"$f":"AH22+1","v":113}]
[{"$f":"Kold!G29","v":"L0"},null,null,null,null,null,null,null,null,null,null,null,null,null,null,null,null,null,null,null,null,null,null,null,null,null,null,null,null,null,null,null,null,null,null,{"$f":"L9+IF(Kold!BR29=1,100,0)","v":109},{"$f":"AJ23+1","v":110}]
[{"$f":"Kold!K29","v":"L0"},null,null,null,null,null,null,null,null,null,null,null,null,null,null,null,null,null,null,null,null,null,null,null,null,null,null,null,null,null,null,null,null,null,null,null,null,{"$f":"M10+IF(Kold!CF29=1,100,0)","v":109},{"$f":"AL24+1","v":110}]
[{"$f":"Kold!G30","v":"L0"},null,null,null,null,null,null,null,null,null,null,null,null,null,null,null,null,null,null,null,null,null,null,null,null,null,null,null,null,null,null,null,null,null,null,null,null,null,null,{"$f":"O11+IF(Kold!BR30=1,100,0)","v":106},{"$f":"AN25+1","v":107}]
[{"$f":"Kold!K30","v":"L0"},null,null,null,null,null,null,null,null,null,null,null,null,null,null,null,null,null,null,null,null,null,null,null,null,null,null,null,null,null,null,null,null,null,null,null,null,null,null,null,null,{"$f":"P12+IF(Kold!CF30=1,100,0)","v":106},{"$f":"AP26+1","v":107}]
[{"$f":"Kold!G31","v":"L0"},null,null,null,null,null,null,null,null,null,null,null,null,null,null,null,null,null,null,null,null,null,null,null,null,null,null,null,null,null,null,null,null,null,null,null,null,null,null,null,null,null,null,{"$f":"R13+IF(Kold!BR31=1,100,0)","v":103},{"$f":"AR27+1","v":104}]
[{"$f":"Kold!K31","v":"L2"},null,null,null,null,null,null,null,null,null,null,null,null,null,null,null,null,null,null,null,null,null,null,null,null,null,null,null,null,null,null,null,null,null,null,null,null,null,null,null,null,null,null,null,null,{"$f":"S14+IF(Kold!CF31=1,100,0)","v":3},{"$f":"AT28+1","v":4}]