{"text_format":"1","workbook":"xlsx","n_sheets":3,"sheets":["Sheet1","Sheet2","Makro"],"not_rendered":{"charts":3,"images":3,"macros":1,"external_links":0,"defined_names":9,"comments":0,"pivot_tables":0},"unopened":[],"bounds":{"document_bytes":16777216,"sheet_cells":100000,"rows_first":2000,"rows_last":500,"rows_between":2000,"halvings":0,"cell_chars":16384,"cell_head_chars":4096},"cells_cut":0,"cells_raw":0,"read":"whole","date_system":"1900"}

{"sheet":"Sheet1","index":0,"n_rows":142,"n_cols":139,"rows_kept":142,"cut":false,"hidden":false,"merged":[[98,48,98,49],[98,46,98,47],[52,89,52,92],[97,50,97,51],[97,52,97,53],[97,46,97,47],[97,48,97,49],[94,66,94,68],[94,70,94,72],[6,109,6,116],[6,101,6,108],[6,89,6,92],[6,93,6,96],[6,97,6,100],[52,93,52,96],[52,97,52,100],[97,54,97,55],[97,56,97,57],[1,10,1,13],[1,14,1,18],[22,10,22,12],[22,13,22,15],[17,45,17,46],[7,43,7,44],[7,45,7,46],[2,10,2,18],[27,13,27,15],[41,10,41,18],[26,14,26,15],[22,16,22,18],[20,54,20,55],[7,47,7,48],[7,51,7,52],[7,57,7,58],[17,47,17,48],[20,56,20,57],[20,52,20,53],[7,53,7,54],[7,55,7,56],[40,20,40,23],[33,20,35,23],[36,21,39,23],[2,2,2,6],[2,8,2,9],[3,2,3,6],[3,8,3,9],[6,2,6,5],[3,10,4,18],[4,2,4,6],[4,8,4,9],[6,6,6,9],[25,14,25,15]]}
[]
[null,"Bruger:",{"$f":"Makro!D20","v":0},null,null,null,null,null,null,null," Letbetonvæg",null,null,null,"Betonelement-Foreningen Feb 2019"]
[null,"Sagsnavn:","Letbetonhuset",null,null,null,null,"Sag nr.:","23 - 4545"]
[null,"Bygningsdel:","Væg i modul B-C/3",null,null,null,null,"Dato:","2019-01-01",null,{"$f":"IF(AM113,\" \",\"NB : \")&AL114&AL115&AL116&AL117&AL118&AL119&AL120&AL121&AL122&AL123&AL124&AL125&AL126&AL127&AL128&AL129&AL130&AL131&AL132&AL133&AL134&AL135&AL136&AL137&AL138&AL139&AL140&AL141&AL142","v":"NB : For ny bruger: Klik på knappen 'angiv nyt brugernavn' for ibrugtagning."}]
[null,"Emne:","Normale lastkombinationer",null,null,null,null,"Init:","JFJ"]
[]
[null,null,"Mindste betonspændinger",null,null,null,"Største betonspændinger",null,null,null,"Materialeparametre",null,null,null,"Afledte parametre",null,null,null,null,null,null,null,null,null,null,null,null,null,null,null,null,null,null,null,null,null,"HOVEDGEOMETRI",null,null,null,null,null,"ELEMENTGRAFIK",null,null,null,null,null,null,null,"VÆGFELTER",null,null,null,null,null,null,null,null,null,null,null,null,null,null,null,null,null,null,null,null,null,null,null,null,null,null,null,null,null,null,null,null,null,null,null,null,null,null,"Venstre",null,null,null,"Midt",null,null,null,"Højre",null,null,null,"Resultat - pr felt",null,null,null,null,null,null,null,"TOTAL",null,null,null,null,null,null,null,null,null,"GRAF",null,{"$f":"COLUMN()","v":122},null,null,null,null,null,null,null,null,{"$f":"COLUMN()","v":131}]
[null,null,"Felt","nEd","mEd","sMIN","Felt","nEd","mEd","sMAX",null,"d",1800,"kg/m3",null,null,"fcd",{"$f":"M9/M12","v":6.4516129032258061},"MPa",null,null,null,null,null,null,null,null,null,null,null,null,null,null,null,null,null,null,null,null,null,null,null,null,"Elementrand",null,"Vindue 2",null,"Vindue 1",null,null,null,"Felt 1",null,"Felt 2",null,"Felt 3",null,"Felt 4",null,null,null,null,"NcR","t","Ls","B","b1","b2","h1","h2","Nabo","L1","L2","Tilf","b_v/H","b_h/H","s1'","s2'","n","en","N1","eN1","N2","eN2","w","mw","s1","s0","s2","n-s1","m-s1","sMIN","sMAX","n-s0","m-s0","sMIN","sMAX","n-s2","m-s2","sMIN","sMAX","ID","n","m","sMIN","ID","n","m","sMAX","ID","n","m","sMIN","ID","n","m","sMAX",null,null,"n","md",{"$f":"OFFSET($DF$10,COLUMN()-119,0)","v":0},{"$f":"OFFSET($DF$10,COLUMN()-119,0)","v":0},0,0,0,0,0,0,0,{"$f":"OFFSET($DJ$10,COLUMN()-128,0)","v":0},{"$f":"OFFSET($DJ$10,COLUMN()-128,0)","v":0},0,0,0,0,0,0,0]
[null,"Lasttilfælde",null,"(KN/m)","(kNm/m)","(MPa)",null,"(KN/m)","(kNm/m)","(MPa)",null,"fck",10,"MPa",null,null,"fctd",{"$f":"AS98/M13","v":1.085498843133534},"MPa",null,null,null,null,null,null,null,null,null,null,null,null,null,null,null,null,null,null,"H","B",null,null,null,null,"x","y","x","y","x","y",null,null,"x","y","x","y","x","y","x","y",null,"Felt 1",null,{"$f":"$R$13/1000","v":0.65115634495708197},{"$f":"$M$19/1000","v":0.15},{"$f":"$AZ$107/1000","v":3},{"$f":"($AZ$11-$AZ$10)/1000","v":1.25},{"$f":"($AZ$16-$AZ$17)/1000","v":0.15},{"$f":"($AZ$12-$AZ$13)/1000","v":0.13500000000000001},{"$f":"$BA$16/1000","v":2.5},{"$f":"$BA$13/1000","v":2.5},{"$f":"IF($BB$10=1000000,FALSE,TRUE)","v":true},{"$f":"IF(AND($AP$13,$AS$76=1),$AT$80,0)","v":0.8},{"$f":"IF(BS9,0.5*$BA$21/1000,IF(AND($AP$17,$AS$77=1),$BB$80,0))","v":0.75},{"$f":"AZ105","v":0},{"$f":"AZ109/M17","v":0.41666666666666669},{"$f":"AZ111/M17","v":0.41666666666666669},{"$f":"BO9+BQ9/6","v":0.56666666666666665},{"$f":"BP9+BR9/6","v":0.55166666666666675},null,null,null,null,null,null,null,null,null,null,null,null,null,null,null,null,null,null,null,null,null,null,null,null,null,null,null,null,null,null,null,null,null,null,null,null,null,null,null,null,null,0,{"$f":"IF($AM$113,MIN((($M$19/1000)^2*1000*$R$9/6+($M$19/6000)*DP9)*($DP$29-DP9)/$DP$29,(($M$19/1000)^2*1000*$R$8/6-($M$19/6000)*DP9)*($DP$29-DP9)/$DP$29),0)","v":0}]
[null,{"$f":"K31","v":"A"},{"$f":"DF10","v":0},{"$f":"DG10","v":0},{"$f":"DH10","v":0},{"$f":"DI10","v":0},{"$f":"DJ10","v":0},{"$f":"DK10","v":0},{"$f":"DL10","v":0},{"$f":"DM10","v":0},{"$f":"IF(AQ98=1,\" Beregnet\",\" Defineret\")","v":" Beregnet"},"ftk",{"$f":"0.42*$M$9^(2/3)*IF($M$8>1400,(0.4+0.6*$M$8/2200),0.78)","v":1.7367981490136544},"MPa","Søjlebæreevne",null,"Ls",{"$f":"M17","v":3000},"mm",null,null,null,null,null,null,null,null,null,null,null,null,null,null,null,null,null,null,{"$f":"M17","v":3000},{"$f":"M18","v":7000},null,null,null,null,0,0,{"$f":"AN16","v":5500},{"$f":"AO16","v":1000},{"$f":"AN14","v":1250},{"$f":"AO14","v":1000},null,1,{"$f":"INDEX(Felt1,AY10,1+($AU$26-1)*2)","v":0},{"$f":"INDEX(Felt1,AY10,2+($AU$26-1)*2)","v":0},{"$f":"INDEX(Felt2,AY10,1+($AU$26-1)*2)","v":2750},{"$f":"INDEX(Felt2,AY10,2+($AU$26-1)*2)","v":0},{"$f":"INDEX(Felt3,AY10,1+($AU$26-1)*2)","v":6500},{"$f":"INDEX(Felt3,AY10,2+($AU$26-1)*2)","v":0},{"$f":"INDEX(Felt4,AY10,1+($AU$26-1)*2)","v":1000000},{"$f":"INDEX(Felt4,AY10,2+($AU$26-1)*2)","v":1000000},null,"Lasttilfælde",{"$f":"K31","v":"A"},{"$f":"BK9","v":0.65115634495708197},{"$f":"BL9","v":0.15},{"$f":"BM9","v":3},{"$f":"BN9","v":1.25},{"$f":"BO9","v":0.15},{"$f":"BP9","v":0.13500000000000001},{"$f":"BQ9","v":2.5},{"$f":"BR9","v":2.5},{"$f":"BS9","v":true},{"$f":"BT9","v":0.8},0.75,{"$f":"BV9","v":0},{"$f":"BW9","v":0.41666666666666669},{"$f":"BX9","v":0.41666666666666669},{"$f":"BY9","v":0.56666666666666665},{"$f":"BZ9","v":0.55166666666666675},{"$f":"SUM(N31:P31)/1000","v":3.0000000000000001E-3},{"$f":"IF(CA10=0,0,(N31*$N$41+O31*$O$41-P31*$P$41)/(1000000*CA10))","v":4.4999999999999998E-2},{"$f":"AT84/1000","v":2.4000000000000002E-3},{"$f":"AU84/1000","v":4.4999999999999991E-2},{"$f":"IF(BS10,BU10*CA10,$BB$84/1000)","v":2.2500000000000003E-3},{"$f":"IF(BS10,CB10,$BC$84/1000)","v":4.4999999999999998E-2},{"$f":"S31/1000","v":9.3999999999999997E-4},{"$f":"0.125*CG10*BM10^2","v":1.0575000000000001E-3},{"$f":"IF(BY10+BZ10<=BN10,BY10,MIN(IF(CC10=0,0,BN10*CC10/(CC10+CE10)),BY10))","v":0.56666666666666665},{"$f":"BN10-CI10-CK10","v":0.1316666666666666},{"$f":"IF(BY10+BZ10<=BN10,BZ10,MIN(IF(CE10=0,0,BN10*CE10/(CC10+CE10)),BZ10))","v":0.55166666666666675},{"$f":"IF(CI10=0,0,CA10+CC10/CI10)","v":7.2352941176470594E-3},{"$f":"IF(CI10=0,CB10*CA10,CB10*CA10+CD10*CC10/CI10)+CH10+IF(BV10=0,CG10*BT10*BM10*IF(BW10>1,0.27,BW10^-1/8-29*BW10^2/800+141*BW10/800)+CG10*BU10*BM10*IF(BX10>1.5,0,BX10^-1/8+2*BX10^2/27-BX10/6),IF(BW10<0.2,CG10*BT10*BM10*0.6*BW10,CG10*BT10*BM10*IF(BW10<1,(1125*BW10^3-3225*BW10^2+3075*BW10-111)/3200,0.27)))","v":2.7261893927015249E-3},{"$f":"CL10/($BL10)-6*($BK10/($BK10-CL10))*(CM10/$BL10^2)","v":-0.68691715696751598},{"$f":"CL10/($BL10)+6*($BK10/($BK10-CL10))*(CM10/$BL10^2)","v":0.78338774520281007},{"$f":"IF(CJ10=0,CL10,CA10)","v":3.0000000000000001E-3},{"$f":"IF(CJ10=0,CM10,CB10*CA10+CH10+IF(BV10=0,CG10*(BT10+BU10)/BN10,0))","v":2.3581000000000001E-3},{"$f":"CP10/($BL10)-6*($BK10/($BK10-CP10))*(CQ10/$BL10^2)","v":-0.61173719900146151},{"$f":"CP10/($BL10)+6*($BK10/($BK10-CP10))*(CQ10/$BL10^2)","v":0.65173719900146154},{"$f":"IF(CK10=0,0,CA10+CE10/CK10)","v":7.0785498489425985E-3},{"$f":"IF(CK10=0,CB10*CA10,CB10*CA10+CE10*CF10/CK10)+CH10+IF(BV10=0,CG10*BU10*BM10*IF(BX10>1,0.27,BX10^-1/8-29*BX10^2/800+141*BX10/800)+CG10*BT10*BM10*IF(BW10>1.5,0,BW10^-1/8+2*BW10^2/27-BW10/6),IF(BX10<0.2,CG10*BU10*BM10*0.6*BX10,CG10*BU10*BM10*IF(BX10<1,(1125*BX10^3-3225*BX10^2+3075*BX10-111)/3200,0.27)))","v":2.7016901878397625E-3},{"$f":"CT10/($BL10)-6*($BK10/($BK10-CT10))*(CU10/$BL10^2)","v":-0.68117828868262476},{"$f":"CT10/($BL10)+6*($BK10/($BK10-CT10))*(CU10/$BL10^2)","v":0.77555895333519276},{"$f":"IF($AM$113,IF(DA10=CN10,\"#1-venstre\",IF(DA10=CR10,\"#1-midt\",\"#1-højre\")),0)","v":0},{"$f":"IF($AM$113,IF(DA10=CN10,CL10,IF(DA10=CR10,CP10,CT10))*1000,0)","v":0},{"$f":"IF($AM$113,IF(DA10=CN10,CM10,IF(DA10=CR10,CQ10,CU10))*1000,0)","v":0},{"$f":"IF($AM$113,MIN(CN10,CR10,CV10),0)","v":0},{"$f":"IF($AM$113,IF(CX10=CO10,\"#1-venstre\",IF(CX10=CS10,\"#1-midt\",\"#1-højre\")),0)","v":0},{"$f":"IF($AM$113,IF(CX10=CO10,CL10,IF(CX10=CS10,CP10,CT10))*1000,0)","v":0},{"$f":"IF($AM$113,IF(CX10=CO10,CM10,IF(CX10=CS10,CQ10,CU10))*1000,0)","v":0},{"$f":"IF($AM$113,MAX(CO10,CS10,CW10),0)","v":0},{"$f":"IF($DA10=$DI10,CX10,IF($DA20=$DI10,CX20,IF($DA30=$DI10,CX30,CX40)))","v":0},{"$f":"IF($DA10=$DI10,CY10,IF($DA20=$DI10,CY20,IF($DA30=$DI10,CY30,CY40)))","v":0},{"$f":"IF($DA10=$DI10,CZ10,IF($DA20=$DI10,CZ20,IF($DA30=$DI10,CZ30,CZ40)))","v":0},{"$f":"MIN(DA10,DA20,DA30,DA40)","v":0},{"$f":"IF($DE10=$DM10,DB10,IF($DE20=$DM10,DB20,IF($DE30=$DM10,DB30,DB40)))","v":0},{"$f":"IF($DE10=$DM10,DC10,IF($DE20=$DM10,DC20,IF($DE30=$DM10,DC30,DC40)))","v":0},{"$f":"IF($DE10=$DM10,DD10,IF($DE20=$DM10,DD20,IF($DE30=$DM10,DD30,DD40)))","v":0},{"$f":"MAX(DE10,DE20,DE30,DE40)","v":0},null,null,{"$f":"IF($AM$113,DP9+$DP$29/20,0)","v":0},0]
[null,"B",{"$f":"DF11","v":0},0,0,0,0,0,0,0,null,"Ecm",{"$f":"10000*M9^(1/3)*(M8/2200)^2","v":14422.248751453108},"MPa","(uden tværvægge)",null,"e5",5,"mm",null,null,null,null,null,null,null,null,null,null,null,null,null,null,null,null,null,null,null,null,null,null,null,null,{"$f":"AN15","v":0},0,{"$f":"AT10+AM16","v":6500},{"$f":"AU10","v":1000},{"$f":"AV10+AM14","v":2750},{"$f":"AW10","v":1000},null,2,1250,0,5500,0,7000,0,1000000,1000000,null,null,{"$f":"K32","v":"B"},{"$f":"BK10","v":0.65115634495708197},0.15,{"$f":"BM10","v":3},{"$f":"BN10","v":1.25},0.15,0.13500000000000001,2.5,2.5,true,0.8,0.75,{"$f":"BV10","v":0},0.41666666666666669,0.41666666666666669,0.56666666666666665,0.55166666666666675,{"$f":"SUM(N32:P32)/1000","v":4.0000000000000001E-3},{"$f":"IF(CA11=0,0,(N32*$N$41+O32*$O$41-P32*$P$41)/(1000000*CA11))","v":4.4999999999999998E-2},{"$f":"AT85/1000","v":3.2000000000000002E-3},{"$f":"AU85/1000","v":4.4999999999999998E-2},3.0000000000000001E-3,{"$f":"IF(BS11,CB11,BC85/1000)","v":4.4999999999999998E-2},{"$f":"S32/1000","v":9.3999999999999997E-4},1.0575000000000001E-3,{"$f":"IF(BY11+BZ11<=BN11,BY11,MIN(IF(CC11=0,0,BN11*CC11/(CC11+CE11)),BY11))","v":0.56666666666666665},{"$f":"BN11-CI11-CK11","v":0.1316666666666666},{"$f":"IF(BY11+BZ11<=BN11,BZ11,MIN(IF(CE11=0,0,BN11*CE11/(CC11+CE11)),BZ11))","v":0.55166666666666675},{"$f":"IF(CI11=0,0,CA11+CC11/CI11)","v":9.6470588235294114E-3},{"$f":"IF(CI11=0,CB11*CA11,CB11*CA11+CD11*CC11/CI11)+CH11+IF(BV11=0,CG11*BT11*BM11*IF(BW11>1,0.27,BW11^-1/8-29*BW11^2/800+141*BW11/800)+CG11*BU11*BM11*IF(BX11>1.5,0,BX11^-1/8+2*BX11^2/27-BX11/6),IF(BW11<0.2,CG11*BT11*BM11*0.6*BW11,CG11*BT11*BM11*IF(BW11<1,(1125*BW11^3-3225*BW11^2+3075*BW11-111)/3200,0.27)))","v":2.8347188044662306E-3},{"$f":"CL11/($BL11)-6*($BK11/($BK11-CL11))*(CM11/$BL11^2)","v":-0.70297893910393239},{"$f":"CL11/($BL11)+6*($BK11/($BK11-CL11))*(CM11/$BL11^2)","v":0.83160639008432458},{"$f":"IF(CJ11=0,CL11,CA11)","v":4.0000000000000001E-3},{"$f":"IF(CJ11=0,CM11,CB11*CA11+CH11+IF(BV11=0,CG11*(BT11+BU11)/BN11,0))","v":2.4031E-3},{"$f":"CP11/($BL11)-6*($BK11/($BK11-CP11))*(CQ11/$BL11^2)","v":-0.61812087697608331},{"$f":"CP11/($BL11)+6*($BK11/($BK11-CP11))*(CQ11/$BL11^2)","v":0.67145421030941654},{"$f":"IF(CK11=0,0,CA11+CE11/CK11)","v":9.4380664652567968E-3},{"$f":"IF(CK11=0,CB11*CA11,CB11*CA11+CE11*CF11/CK11)+CH11+IF(BV11=0,CG11*BU11*BM11*IF(BX11>1,0.27,BX11^-1/8-29*BX11^2/800+141*BX11/800)+CG11*BT11*BM11*IF(BW11>1.5,0,BW11^-1/8+2*BW11^2/27-BW11/6),IF(BX11<0.2,CG11*BU11*BM11*0.6*BX11,CG11*BU11*BM11*IF(BX11<1,(1125*BX11^3-3225*BX11^2+3075*BX11-111)/3200,0.27)))","v":2.8078684355739014E-3},{"$f":"CT11/($BL11)-6*($BK11/($BK11-CT11))*(CU11/$BL11^2)","v":-0.69685692708663116},{"$f":"CT11/($BL11)+6*($BK11/($BK11-CT11))*(CU11/$BL11^2)","v":0.82269781329005509},{"$f":"IF($AM$113,IF(DA11=CN11,\"#1-venstre\",IF(DA11=CR11,\"#1-midt\",\"#1-højre\")),0)","v":0},{"$f":"IF($AM$113,IF(DA11=CN11,CL11,IF(DA11=CR11,CP11,CT11))*1000,0)","v":0},{"$f":"IF($AM$113,IF(DA11=CN11,CM11,IF(DA11=CR11,CQ11,CU11))*1000,0)","v":0},{"$f":"IF($AM$113,MIN(CN11,CR11,CV11),0)","v":0},{"$f":"IF($AM$113,IF(CX11=CO11,\"#1-venstre\",IF(CX11=CS11,\"#1-midt\",\"#1-højre\")),0)","v":0},{"$f":"IF($AM$113,IF(CX11=CO11,CL11,IF(CX11=CS11,CP11,CT11))*1000,0)","v":0},{"$f":"IF($AM$113,IF(CX11=CO11,CM11,IF(CX11=CS11,CQ11,CU11))*1000,0)","v":0},{"$f":"IF($AM$113,MAX(CO11,CS11,CW11),0)","v":0},{"$f":"IF($DA11=$DI11,CX11,IF($DA21=$DI11,CX21,IF($DA31=$DI11,CX31,CX41)))","v":0},{"$f":"IF($DA11=$DI11,CY11,IF($DA21=$DI11,CY21,IF($DA31=$DI11,CY31,CY41)))","v":0},{"$f":"IF($DA11=$DI11,CZ11,IF($DA21=$DI11,CZ21,IF($DA31=$DI11,CZ31,CZ41)))","v":0},{"$f":"MIN(DA11,DA21,DA31,DA41)","v":0},{"$f":"IF($DE11=$DM11,DB11,IF($DE21=$DM11,DB21,IF($DE31=$DM11,DB31,DB41)))","v":0},{"$f":"IF($DE11=$DM11,DC11,IF($DE21=$DM11,DC21,IF($DE31=$DM11,DC31,DC41)))","v":0},0,{"$f":"MAX(DE11,DE21,DE31,DE41)","v":0},null,null,0,0]
[null,"C",0,0,0,0,0,0,0,0,null,"gcm",1.55,null,null,null,"ks",{"$f":"1/(1+12*($M$9/($M$11*PI()^2))*(R10/($M$19-2*$R$11))^2)","v":0.72092309620248363},null,null,null,null,null,null,null,null,null,null,null,null,null,null,null,null,null,null,null,"h","b","x","y",null,null,{"$f":"AR11","v":0},{"$f":"AL15","v":0},{"$f":"AT11","v":6500},{"$f":"AU11+AL16","v":2500},{"$f":"AV11","v":2750},{"$f":"AW11+AL14","v":2500},null,3,1250,2500,5500,2500,7000,2500,1000000,1000000,null,null,"C",0.65115634495708197,0.15,3,1.25,0.15,0.13500000000000001,2.5,2.5,true,0.8,0.75,0,0.41666666666666669,0.41666666666666669,0.56666666666666665,0.55166666666666675,1.6E-2,2.2499999999999999E-2,1.2800000000000001E-2,2.2499999999999999E-2,1.2E-2,2.2499999999999999E-2,9.3999999999999997E-4,1.0575000000000001E-3,0.56666666666666665,0.1316666666666666,0.55166666666666675,3.8588235294117645E-2,3.2688364515250541E-3,-0.66934621116110682,1.1838560150826754,1.6E-2,2.5830999999999996E-3,-0.59951199018977175,0.81284532352310512,3.7752265861027187E-2,3.2325814265104572E-3,-0.66339350589457968,1.1667570507082754,0,0,0,0,0,0,0,0,0,0,0,0,0,0,{"$f":"IF($DE12=$DM12,DD12,IF($DE22=$DM12,DD22,IF($DE32=$DM12,DD32,DD42)))","v":0},0,null,null,0,0]
[null,"D",0,0,0,0,0,0,0,0,null,"gtm",1.6,null,null,null,"Ncr",{"$f":"R12*$R$8*($M$19-2*$R$11)","v":651.15634495708196},"kN/m",null,null,null,null,null,null,null,null,null,null,null,null,null,null,null,null,null,null,{"$f":"P15","v":500},150,null,null,{"$f":"Makro!A1","v":true},null,{"$f":"AR12+AM15","v":0},{"$f":"AS12","v":0},{"$f":"AT10","v":5500},{"$f":"AU12","v":2500},{"$f":"AV10","v":1250},{"$f":"AW12","v":2500},null,4,1115,2500,5365,2500,6850,2500,1000000,1000000,null,null,"D",0.65115634495708197,0.15,3,1.25,0.15,0.13500000000000001,2.5,2.5,true,0.8,0.75,0,0.41666666666666669,0.41666666666666669,0.56666666666666665,0.55166666666666675,1.6E-2,2.2499999999999999E-2,1.2800000000000001E-2,2.2499999999999999E-2,1.2E-2,2.2499999999999999E-2,9.3999999999999997E-4,1.0575000000000001E-3,0.56666666666666665,0.1316666666666666,0.55166666666666675,3.8588235294117645E-2,3.2688364515250541E-3,-0.66934621116110682,1.1838560150826754,1.6E-2,2.5830999999999996E-3,-0.59951199018977175,0.81284532352310512,3.7752265861027187E-2,3.2325814265104572E-3,-0.66339350589457968,1.1667570507082754,0,0,0,0,0,0,0,0,0,0,0,0,0,0,0,0,null,null,0,0]
[null,"E",0,0,0,0,0,0,0,0,"Geometri - alle mål i mm",null,null,"Udsparinger",null,"h","b","x","y",null,null,null,null,null,null,null,null,null,null,null,null,null,null,null,null,null,null,1500,1500,{"$f":"R16","v":1250},{"$f":"S16","v":1000},{"$f":"Makro!A2","v":true},null,{"$f":"AR13","v":0},{"$f":"0","v":0},{"$f":"AT10","v":5500},{"$f":"AU10","v":1000},{"$f":"AV10","v":1250},{"$f":"AW10","v":1000},null,5,1115,3000,5365,3000,6850,3000,1000000,1000000,null,null,"E",0.65115634495708197,0.15,3,1.25,0.15,0.13500000000000001,2.5,2.5,true,0.8,0.75,0,0.41666666666666669,0.41666666666666669,0.56666666666666665,0.55166666666666675,5.0000000000000001E-3,4.4999999999999998E-2,4.0000000000000001E-3,4.4999999999999998E-2,3.7499999999999999E-3,4.4999999999999998E-2,4.6999999999999999E-4,5.2875000000000003E-4,0.56666666666666665,0.1316666666666666,0.55166666666666675,1.2058823529411764E-2,1.7429476375272329E-3,-0.39316370383219573,0.55394801755768597,5.0000000000000001E-3,1.3365500000000002E-3,-0.32583794965192991,0.39250461631859657,1.1797583081570997E-2,1.7224689609893675E-3,-0.38915006545995529,0.5464511732142352,0,0,0,0,0,0,0,0,0,0,0,0,0,0,0,0,null,null,0,0]
[null,"F",0,0,0,0,0,0,0,0,null,null,null,"  Bjælke A",null,500,150,null,null,null,null,null,null,null,null,null,null,null,null,null,null,null,null,null,null,null,null,0,0,{"$f":"R17","v":0},null,{"$f":"Makro!A3","v":false},null,{"$f":"AM10","v":7000},0,null,null,null,null,null,6,150,3000,2885,3000,6635,3000,1000000,1000000,null,null,"F",0.65115634495708197,0.15,3,1.25,0.15,0.13500000000000001,2.5,2.5,true,0.8,0.75,0,0.41666666666666669,0.41666666666666669,0.56666666666666665,0.55166666666666675,1.7000000000000001E-2,2.3823529411764705E-2,1.3600000000000001E-2,2.3823529411764705E-2,1.2750000000000001E-2,2.3823529411764705E-2,4.6999999999999999E-4,5.2875000000000003E-4,0.56666666666666665,0.1316666666666666,0.55166666666666675,4.1000000000000009E-2,2.1770652845860567E-3,-0.3462280343545806,0.89289470102124746,1.7000000000000001E-2,1.5165500000000002E-3,-0.30192121718774573,0.52858788385441247,4.0111782477341387E-2,2.1471819519259237E-3,-0.34275688360397238,0.87758064996852425,0,0,0,0,0,0,0,0,0,0,0,0,0,0,0,0,null,null,0,0]
[null,"G",0,0,0,0,0,0,0,0,"Hovedmål",null,null,"  Vindue 1",null,1500,1500,1250,1000,null,null,null,null,null,null,null,null,null,null,null,null,null,null,null,null,null,null,1500,1000,{"$f":"R18","v":5500},{"$f":"S18","v":1000},{"$f":"Makro!A4","v":true},null,{"$f":"AR15","v":7000},{"$f":"AL10-AL17","v":2500},null,null,null,null,null,7,150,2500,2885,2500,6635,2500,1000000,1000000,null,null,"G",0.65115634495708197,0.15,3,1.25,0.15,0.13500000000000001,2.5,2.5,true,0.8,0.75,0,0.41666666666666669,0.41666666666666669,0.56666666666666665,0.55166666666666675,1.7000000000000001E-2,2.3823529411764705E-2,1.3600000000000001E-2,2.3823529411764705E-2,1.2750000000000001E-2,2.3823529411764705E-2,4.6999999999999999E-4,5.2875000000000003E-4,0.56666666666666665,0.1316666666666666,0.55166666666666675,4.1000000000000009E-2,2.1770652845860567E-3,-0.3462280343545806,0.89289470102124746,1.7000000000000001E-2,1.5165500000000002E-3,-0.30192121718774573,0.52858788385441247,4.0111782477341387E-2,2.1471819519259237E-3,-0.34275688360397238,0.87758064996852425,0,0,0,0,0,0,0,0,0,0,0,0,0,0,0,0,null,null,0,0]
[null,"H",0,0,0,0,0,0,0,0,"  Væghøjde,    H",null,3000,"  Dør",null,null,null,null,null,null,null,null,null,null,null,null,null,null,null,null,null,null,null,null,null,null,null,500,150,null,null,{"$f":"Makro!A5","v":true},null,{"$f":"AR16-AM17","v":6850},{"$f":"AS16","v":2500},null,null,null,null,null,8,0,2500,2750,2500,6500,2500,1000000,1000000,null,null,"H",0.65115634495708197,0.15,3,1.25,0.15,0.13500000000000001,2.5,2.5,true,0.8,0.75,0,0.41666666666666669,0.41666666666666669,0.56666666666666665,0.55166666666666675,0.02,2.2499999999999999E-2,1.6E-2,2.2499999999999999E-2,1.4999999999999999E-2,2.2499999999999999E-2,4.6999999999999999E-4,5.2875000000000003E-4,0.56666666666666665,0.1316666666666666,0.55166666666666675,4.8235294117647057E-2,2.2855946963507628E-3,-0.33668427269548812,0.97982152759744889,0.02,1.5615500000000001E-3,-0.29627525143525735,0.56294191810192407,4.7190332326283987E-2,2.2533601996600622E-3,-0.33324430158979212,0.96244873260691199,0,0,0,0,0,0,0,0,0,0,0,0,0,0,0,0,null,null,0,0]
[null,"I",0,0,0,0,0,0,0,0,"  Vægbredde,  B",null,7000,"  Vindue 2",null,1500,1000,5500,1000,null,null,null,null,null,null,null,null,null,null,null,null,null,null,null,null,null,null,null,null,null,null,null,null,{"$f":"AR17","v":6850},{"$f":"AL10","v":3000},"NA",null,"NB",null,null,9,0,0,2750,0,6500,0,1000000,1000000,null,null,"I",0.65115634495708197,0.15,3,1.25,0.15,0.13500000000000001,2.5,2.5,true,0.8,0.75,0,0.41666666666666669,0.41666666666666669,0.56666666666666665,0.55166666666666675,{"$f":"SUM(N39:P39)/1000","v":0.02},2.2499999999999999E-2,1.6E-2,2.2499999999999999E-2,1.4999999999999999E-2,2.2499999999999999E-2,{"$f":"S39/1000","v":4.6999999999999999E-4},5.2875000000000003E-4,0.56666666666666665,0.1316666666666666,0.55166666666666675,{"$f":"IF(CI18=0,0,CA18+CC18/CI18)","v":4.8235294117647057E-2},2.2855946963507628E-3,{"$f":"CL18/($BL18)-6*($BK18/($BK18-CL18))*(CM18/$BL18^2)","v":-0.33668427269548812},{"$f":"CL18/($BL18)+6*($BK18/($BK18-CL18))*(CM18/$BL18^2)","v":0.97982152759744889},0.02,1.5615500000000001E-3,{"$f":"CP18/($BL18)-6*($BK18/($BK18-CP18))*(CQ18/$BL18^2)","v":-0.29627525143525735},{"$f":"CP18/($BL18)+6*($BK18/($BK18-CP18))*(CQ18/$BL18^2)","v":0.56294191810192407},{"$f":"IF(CK18=0,0,CA18+CE18/CK18)","v":4.7190332326283987E-2},2.2533601996600622E-3,{"$f":"CT18/($BL18)-6*($BK18/($BK18-CT18))*(CU18/$BL18^2)","v":-0.33324430158979212},0.96244873260691199,0,0,0,0,0,0,0,0,0,0,0,0,0,0,0,0,null,null,0,0]
[null,"Resultat af styrkekontrol:",null,null,null,null,null,null,null,null,"  Vægtykkelse, t",null,150,"  Bjælke B",null,500,150,null,null,null,null,null,null,null,null,null,null,null,null,null,null,null,null,null,null,null,null,null,null,null,null,null,null,{"$f":"AM13","v":150},{"$f":"AS18","v":3000},"x","y","x","y",null,null,null,null,null,null,null,null,null,null,null,"Felt 2",null,{"$f":"$R$13/1000","v":0.65115634495708197},{"$f":"$M$19/1000","v":0.15},{"$f":"$BB$107/1000","v":2.5862068965517242},{"$f":"($BB$11-$BB$10)/1000","v":2.75},{"$f":"($BB$16-$BB$17)/1000","v":0.13500000000000001},{"$f":"($BB$12-$BB$13)/1000","v":0.13500000000000001},{"$f":"$BC$16/1000","v":2.5},{"$f":"$BC$13/1000","v":2.5},{"$f":"IF($BD$10=1000000,FALSE,TRUE)","v":true},{"$f":"BU9","v":0.75},{"$f":"IF(BS19,0.5*$BC$21/1000,IF(AND($AP$17,$AS$77=1),$BB$80,0))","v":0.5},{"$f":"BB105","v":1},{"$f":"BB109/M17","v":8.3333333333333329E-2},{"$f":"BB111/M17","v":0.83333333333333337},{"$f":"BO19+BQ19/6","v":0.55166666666666675},{"$f":"BP19+BR19/6","v":0.55166666666666675},null,null,null,null,null,null,null,null,null,null,null,null,null,null,null,null,null,null,null,null,null,null,null,null,null,null,null,null,null,null,null,null,null,null,null,null,null,null,null,null,null,0,0]
[null,null,"Mindste betonspænding:",null,null,{"$f":"IF($AM$113,MIN(F10:F18),\"-\")","v":"-"},"MPa",{"$f":"IF($AM$113,IF(F20<-R9,\"Trækstyrke overskredet !\",\" OK !\"),\"-\")","v":"-"},null,null,"Interne overliggere",null,null,"Tværvæg 1",null,"x =",3000,null,null,null,null,null,null,null,null,null,null,null,null,null,null,null,null,null,null,null,null,"Vederlagsdybder",null,null,{"$f":"M21","v":135},null,null,{"$f":"AR19","v":150},{"$f":"AS19-AL13","v":2500},{"$f":"IF(AP13,0.5*(AR21+AR20),1000000)","v":75},{"$f":"IF(AP13,AS20,1000000)","v":2500},{"$f":"IF(AP17,0.5*(AR16+AR17),1000000)","v":6925},{"$f":"IF(AP17,AS16,1000000)","v":2500},null,"OVERLIGGERE",null,null,null,null,null,null,null,null,null,"Lasttilfælde",{"$f":"K31","v":"A"},{"$f":"BK19","v":0.65115634495708197},{"$f":"BL19","v":0.15},{"$f":"BM19","v":2.5862068965517242},{"$f":"BN19","v":2.75},{"$f":"BO19","v":0.13500000000000001},{"$f":"BP19","v":0.13500000000000001},{"$f":"BQ19","v":2.5},{"$f":"BR19","v":2.5},{"$f":"BS19","v":true},{"$f":"BT19","v":0.75},0.5,{"$f":"BV19","v":1},{"$f":"BW19","v":8.3333333333333329E-2},{"$f":"BX19","v":0.83333333333333337},{"$f":"BY19","v":0.55166666666666675},{"$f":"BZ19","v":0.55166666666666675},{"$f":"CA10","v":3.0000000000000001E-3},{"$f":"CB10","v":4.4999999999999998E-2},{"$f":"CE10","v":2.2500000000000003E-3},{"$f":"CF10","v":4.4999999999999998E-2},{"$f":"IF(BS20,BU20*CA20,BB84/1000)","v":1.5E-3},{"$f":"IF(BS20,CB20,BC84/1000)","v":4.4999999999999998E-2},{"$f":"CG10","v":9.3999999999999997E-4},{"$f":"0.125*CG20*BM20^2","v":7.8589476813317478E-4},{"$f":"IF(BY20+BZ20<=BN20,BY20,MIN(IF(CC20=0,0,BN20*CC20/(CC20+CE20)),BY20))","v":0.55166666666666675},{"$f":"BN20-CI20-CK20","v":1.6466666666666665},{"$f":"IF(BY20+BZ20<=BN20,BZ20,MIN(IF(CE20=0,0,BN20*CE20/(CC20+CE20)),BZ20))","v":0.55166666666666675},{"$f":"IF(CI20=0,0,CA20+CC20/CI20)","v":7.0785498489425985E-3},{"$f":"IF(BS10,IF(CI20=0,CB20*CA20,CB20*CA20+CD20*CC20/CI20)+CH20+IF(BV20=0,CG20*BT20*BM20*IF(BW20>1,0.27,BW20^-1/8-29*BW20^2/800+141*BW20/800)+CG20*BU20*BM20*IF(BX20>1.5,0,BX20^-1/8+2*BX20^2/27-BX20/6),IF(BW20<0.2,CG20*BT20*BM20*0.6*BW20,CG20*BT20*BM20*IF(BW20<1,(1125*BW20^3-3225*BW20^2+3075*BW20-111)/3200,0.27))),0)","v":1.19559330443904E-3},{"$f":"CL20/($BL20)-6*($BK20/($BK20-CL20))*(CM20/$BL20^2)","v":-0.27513850106895243},{"$f":"CL20/($BL20)+6*($BK20/($BK20-CL20))*(CM20/$BL20^2)","v":0.36951916572152044},{"$f":"IF(CJ20=0,CL20,CA20)","v":3.0000000000000001E-3},{"$f":"IF(CJ20=0,CM20,CB20*CA20+CH20+IF(BV20=0,CG20*(BT20+BU20)/BN20,0))","v":9.2089476813317481E-4},{"$f":"CP20/($BL20)-6*($BK20/($BK20-CP20))*(CQ20/$BL20^2)","v":-0.22670857105108019},{"$f":"CP20/($BL20)+6*($BK20/($BK20-CP20))*(CQ20/$BL20^2)","v":0.2667085710510802},{"$f":"IF(CK20=0,0,CA20+CE20/CK20)","v":5.7190332326283984E-3},{"$f":"IF(BS10,IF(CK20=0,CB20*CA20,CB20*CA20+CE20*CF20/CK20)+CH20+IF(BV20=0,CG20*BU20*BM20*IF(BX20>1,0.27,BX20^-1/8-29*BX20^2/800+141*BX20/800)+CG20*BT20*BM20*IF(BW20>1.5,0,BW20^-1/8+2*BW20^2/27-BW20/6),IF(BX20<0.2,CG20*BU20*BM20*0.6*BX20,CG20*BU20*BM20*IF(BX20<1,(1125*BX20^3-3225*BX20^2+3075*BX20-111)/3200,0.27))),0)","v":1.3710452425885217E-3},{"$f":"CT20/($BL20)-6*($BK20/($BK20-CT20))*(CU20/$BL20^2)","v":-0.33072475917153593},{"$f":"CT20/($BL20)+6*($BK20/($BK20-CT20))*(CU20/$BL20^2)","v":0.4069785356065812},{"$f":"IF($AM$113,IF(DA20=CN20,\"#2-venstre\",IF(DA20=CR20,\"#2-midt\",\"#2-højre\")),0)","v":0},{"$f":"IF($AM$113,IF(DA20=CN20,CL20,IF(DA20=CR20,CP20,CT20))*1000,0)","v":0},{"$f":"IF($AM$113,IF(DA20=CN20,CM20,IF(DA20=CR20,CQ20,CU20))*1000,0)","v":0},{"$f":"IF($AM$113,MIN(CN20,CR20,CV20),0)","v":0},{"$f":"IF($AM$113,IF(CX20=CO20,\"#2-venstre\",IF(CX20=CS20,\"#2-midt\",\"#2-højre\")),0)","v":0},{"$f":"IF($AM$113,IF(CX20=CO20,CL20,IF(CX20=CS20,CP20,CT20))*1000,0)","v":0},{"$f":"IF($AM$113,IF(CX20=CO20,CM20,IF(CX20=CS20,CQ20,CU20))*1000,0)","v":0},{"$f":"IF($AM$113,MAX(CO20,CS20,CW20),0)","v":0},null,null,null,null,null,null,null,null,null,null,0,0]
[null,null,"Største betonspænding:",null,null,{"$f":"IF($AM$113,MAX(J10:J18),\"-\")","v":"-"},"MPa",{"$f":"IF($AM$113,IF(F21>R8,\"Trykstyrke overskredet !\",\" OK !\"),\"-\")","v":"-"},null,null,"  Vederlagsdybder",null,135,"Tværvæg 2",null,"x =",6750,null,null,null,null,null,null,null,null,null,null,null,null,null,null,null,null,null,null,null,null,null,null,null,null,null,null,0,{"$f":"AS20","v":2500},{"$f":"AT20","v":75},{"$f":"AU20+400","v":2900},{"$f":"AV20","v":6925},{"$f":"AW20+400","v":2900},null,null,null,{"$f":"IF(BB10=1000000,0,BB15-AZ13-2*AO20)","v":1500},null,{"$f":"IF(BD10=1000000,0,BD15-BB13-2*AO20)","v":1000},null,{"$f":"IF(BF10=1000000,0,BF15-BD13-2*AO20)","v":0},null,null,null,null,{"$f":"K32","v":"B"},{"$f":"BK20","v":0.65115634495708197},0.15,{"$f":"BM20","v":2.5862068965517242},{"$f":"BN20","v":2.75},0.13500000000000001,0.13500000000000001,2.5,2.5,true,0.75,0.5,1,8.3333333333333329E-2,0.83333333333333337,0.55166666666666675,0.55166666666666675,4.0000000000000001E-3,4.4999999999999998E-2,{"$f":"CE11","v":3.0000000000000001E-3},{"$f":"CF11","v":4.4999999999999998E-2},2E-3,4.4999999999999998E-2,9.3999999999999997E-4,7.8589476813317478E-4,{"$f":"IF(BY21+BZ21<=BN21,BY21,MIN(IF(CC21=0,0,BN21*CC21/(CC21+CE21)),BY21))","v":0.55166666666666675},1.6466666666666665,{"$f":"IF(BY21+BZ21<=BN21,BZ21,MIN(IF(CE21=0,0,BN21*CE21/(CC21+CE21)),BZ21))","v":0.55166666666666675},{"$f":"IF(CI21=0,0,CA21+CC21/CI21)","v":9.4380664652567968E-3},{"$f":"IF(BS11,IF(CI21=0,CB21*CA21,CB21*CA21+CD21*CC21/CI21)+CH21+IF(BV21=0,CG21*BT21*BM21*IF(BW21>1,0.27,BW21^-1/8-29*BW21^2/800+141*BW21/800)+CG21*BU21*BM21*IF(BX21>1.5,0,BX21^-1/8+2*BX21^2/27-BX21/6),IF(BW21<0.2,CG21*BT21*BM21*0.6*BW21,CG21*BT21*BM21*IF(BW21<1,(1125*BW21^3-3225*BW21^2+3075*BW21-111)/3200,0.27))),0)","v":1.3017715521731789E-3},{"$f":"CL21/($BL21)-6*($BK21/($BK21-CL21))*(CM21/$BL21^2)","v":-0.28932418273809585},{"$f":"CL21/($BL21)+6*($BK21/($BK21-CL21))*(CM21/$BL21^2)","v":0.41516506894151978},{"$f":"IF(CJ21=0,CL21,CA21)","v":4.0000000000000001E-3},{"$f":"IF(CJ21=0,CM21,CB21*CA21+CH21+IF(BV21=0,CG21*(BT21+BU21)/BN21,0))","v":9.6589476813317482E-4},{"$f":"CP21/($BL21)-6*($BK21/($BK21-CP21))*(CQ21/$BL21^2)","v":-0.23249729445104517},{"$f":"CP21/($BL21)+6*($BK21/($BK21-CP21))*(CQ21/$BL21^2)","v":0.28583062778437851},{"$f":"IF(CK21=0,0,CA21+CE21/CK21)","v":7.6253776435045318E-3},{"$f":"IF(BS11,IF(CK21=0,CB21*CA21,CB21*CA21+CE21*CF21/CK21)+CH21+IF(BV21=0,CG21*BU21*BM21*IF(BX21>1,0.27,BX21^-1/8-29*BX21^2/800+141*BX21/800)+CG21*BT21*BM21*IF(BW21>1.5,0,BW21^-1/8+2*BW21^2/27-BW21/6),IF(BX21<0.2,CG21*BU21*BM21*0.6*BX21,CG21*BU21*BM21*IF(BX21<1,(1125*BX21^3-3225*BX21^2+3075*BX21-111)/3200,0.27))),0)","v":1.4568307410779476E-3},{"$f":"CT21/($BL21)-6*($BK21/($BK21-CT21))*(CU21/$BL21^2)","v":-0.34225565150467724},{"$f":"CT21/($BL21)+6*($BK21/($BK21-CT21))*(CU21/$BL21^2)","v":0.44392735341807105},{"$f":"IF($AM$113,IF(DA21=CN21,\"#2-venstre\",IF(DA21=CR21,\"#2-midt\",\"#2-højre\")),0)","v":0},{"$f":"IF($AM$113,IF(DA21=CN21,CL21,IF(DA21=CR21,CP21,CT21))*1000,0)","v":0},{"$f":"IF($AM$113,IF(DA21=CN21,CM21,IF(DA21=CR21,CQ21,CU21))*1000,0)","v":0},{"$f":"IF($AM$113,MIN(CN21,CR21,CV21),0)","v":0},{"$f":"IF($AM$113,IF(CX21=CO21,\"#2-venstre\",IF(CX21=CS21,\"#2-midt\",\"#2-højre\")),0)","v":0},{"$f":"IF($AM$113,IF(CX21=CO21,CL21,IF(CX21=CS21,CP21,CT21))*1000,0)","v":0},{"$f":"IF($AM$113,IF(CX21=CO21,CM21,IF(CX21=CS21,CQ21,CU21))*1000,0)","v":0},{"$f":"IF($AM$113,MAX(CO21,CS21,CW21),0)","v":0},null,null,null,null,null,null,null,null,null,null,0,0]
[null,null,null,null,null,null,null,null,null,null,"Jævnt fordelte laste på vægoverside",null,null,null,null,null,null,null,null,null,null,null,null,null,null,null,null,null,null,null,null,null,null,null,null,null,null,null,null,null,null,null,null,0,0,null,null,null,null,null,null,null,null,null,null,null,null,null,null,null,null,"C",0.65115634495708197,0.15,2.5862068965517242,2.75,0.13500000000000001,0.13500000000000001,2.5,2.5,true,0.75,0.5,1,8.3333333333333329E-2,0.83333333333333337,0.55166666666666675,0.55166666666666675,1.6E-2,2.2499999999999999E-2,1.2E-2,2.2499999999999999E-2,8.0000000000000002E-3,2.2499999999999999E-2,9.3999999999999997E-4,7.8589476813317478E-4,0.55166666666666675,1.6466666666666665,0.55166666666666675,3.7752265861027187E-2,1.7264845431097346E-3,-0.23704940411132625,0.74041294892502207,1.6E-2,1.1458947681331749E-3,-0.20660282667819241,0.41993616001152578,3.0501510574018127E-2,1.7999727350356514E-3,-0.30023812640577019,0.7069249340593452,0,0,0,0,0,0,0,0,null,null,null,null,null,null,null,null,null,null,0,0]
[null,null,null,null,null,null,null,null,null,null,"Maksimallaste (kN/m)",null,null,"Reducerede laste (kN/m)",null,null,"Minimallaste (kN/m)",null,null,null,null,null,null,null,null,null,null,null,null,null,null,null,null,null,null,null,null,null,null,null,null,null,null,null,null,null,null,null,null,null,null,null,null,null,null,null,null,null,null,null,null,"D",0.65115634495708197,0.15,2.5862068965517242,2.75,0.13500000000000001,0.13500000000000001,2.5,2.5,true,0.75,0.5,1,8.3333333333333329E-2,0.83333333333333337,0.55166666666666675,0.55166666666666675,1.6E-2,2.2499999999999999E-2,1.2E-2,2.2499999999999999E-2,8.0000000000000002E-3,2.2499999999999999E-2,9.3999999999999997E-4,7.8589476813317478E-4,0.55166666666666675,1.6466666666666665,0.55166666666666675,3.7752265861027187E-2,1.7264845431097346E-3,-0.23704940411132625,0.74041294892502207,1.6E-2,1.1458947681331749E-3,-0.20660282667819241,0.41993616001152578,3.0501510574018127E-2,1.7999727350356514E-3,-0.30023812640577019,0.7069249340593452,0,0,0,0,0,0,0,0,null,null,null,null,null,null,null,null,null,null,0,0]
[null,null,null,null,null,null,null,null,null,null,"nv","no","nh","nv","no","nh","nv","no","nh",null,null,null,null,null,null,null,null,null,null,null,null,null,null,null,null,null,null,null,null,null,null,null,null,null,null,null,null,null,null,null,null,null,null,null,null,null,null,null,null,null,null,"E",0.65115634495708197,0.15,2.5862068965517242,2.75,0.13500000000000001,0.13500000000000001,2.5,2.5,true,0.75,0.5,1,8.3333333333333329E-2,0.83333333333333337,0.55166666666666675,0.55166666666666675,5.0000000000000001E-3,4.4999999999999998E-2,3.7499999999999999E-3,4.4999999999999998E-2,2.5000000000000001E-3,4.4999999999999998E-2,4.6999999999999999E-4,3.9294738406658739E-4,0.55166666666666675,1.6466666666666665,0.55166666666666675,1.1797583081570997E-2,9.6942051928900624E-4,-0.18463170524757749,0.34193281300185746,5.0000000000000001E-3,6.1794738406658733E-4,-0.13272776034261097,0.19939442700927762,9.5317220543806643E-3,9.8577186600725189E-4,{"$f":"CT24/($BL24)-6*($BK24/($BK24-CT24))*(CU24/$BL24^2)","v":-0.20323281393605919},0.33032244132780142,0,0,0,0,0,0,0,0,null,null,null,null,null,null,null,null,null,null,0,0]
[null,null,null,null,null,null,null,null,null,null,5,15,0,4,12,0,3,0,0,null,null,null,null,null,null,null,null,null,null,null,null,null,null,null,null,null,null,null,null,null,null,null,null,null,null,null,null,null,null,null,null,null,null,null,null,null,null,null,null,null,null,"F",0.65115634495708197,0.15,2.5862068965517242,2.75,0.13500000000000001,0.13500000000000001,2.5,2.5,true,0.75,0.5,1,8.3333333333333329E-2,0.83333333333333337,0.55166666666666675,0.55166666666666675,1.7000000000000001E-2,2.3823529411764705E-2,1.2750000000000001E-2,2.3823529411764705E-2,8.5000000000000006E-3,2.3823529411764705E-2,4.6999999999999999E-4,3.9294738406658739E-4,0.55166666666666675,1.6466666666666665,0.55166666666666675,4.0111782477341387E-2,1.3941335102255624E-3,-0.12876167998814603,0.66358544635269789,1.7000000000000001E-2,7.9794738406658737E-4,-0.10515684655525689,0.3318235132219236,3.2407854984894263E-2,1.3289138599649557E-3,-0.15688567674421922,0.58899040987614271,0,0,0,0,0,0,0,0,null,null,null,null,null,null,null,null,null,null,0,0]
[null,null,null,null,null,null,null,null,null,null,"  Belastning fra bjælke A (venstre side) som:",null,null,null,{"$f":"INDEX(AP76:AP77,AS76,1)","v":"Vægoverligger"},null,"LA (m)","LB (m)",null,null,null,null,null,null,null,null,null,null,null,null,null,null,null,null,null,null,"INDDATAFORMATER",null,null,null,null,null,"BASISTILFÆLDE:",null,null,null,{"$f":"MIN(AQ32:BE32)","v":5},null,null,null,null,null,null,null,null,null,null,null,null,null,null,"G",0.65115634495708197,0.15,2.5862068965517242,2.75,0.13500000000000001,0.13500000000000001,2.5,2.5,true,0.75,0.5,1,8.3333333333333329E-2,0.83333333333333337,0.55166666666666675,0.55166666666666675,1.7000000000000001E-2,2.3823529411764705E-2,1.2750000000000001E-2,2.3823529411764705E-2,8.5000000000000006E-3,2.3823529411764705E-2,4.6999999999999999E-4,3.9294738406658739E-4,0.55166666666666675,1.6466666666666665,0.55166666666666675,4.0111782477341387E-2,1.3941335102255624E-3,-0.12876167998814603,0.66358544635269789,1.7000000000000001E-2,7.9794738406658737E-4,-0.10515684655525689,0.3318235132219236,3.2407854984894263E-2,1.3289138599649557E-3,-0.15688567674421922,0.58899040987614271,0,0,0,0,0,0,0,0,null,null,null,null,null,null,null,null,null,null,0,0]
[null,null,null,null,null,null,null,null,null,null,"  Belastning fra bjælke B (højre side) som:",null,null,null,{"$f":"INDEX(AP76:AP77,AS77,1)","v":"Vægoverligger"},null,1.6,1.2,null,null,null,null,null,null,null,null,null,null,null,null,null,null,null,null,null,null,null,"h","b","x","y",null,null,null,null,null,null,null,null,null,null,null,null,null,null,null,null,null,null,null,null,"H",0.65115634495708197,0.15,2.5862068965517242,2.75,0.13500000000000001,0.13500000000000001,2.5,2.5,true,0.75,0.5,1,8.3333333333333329E-2,0.83333333333333337,0.55166666666666675,0.55166666666666675,0.02,2.2499999999999999E-2,1.4999999999999999E-2,2.2499999999999999E-2,0.01,2.2499999999999999E-2,4.6999999999999999E-4,3.9294738406658739E-4,0.55166666666666675,1.6466666666666665,0.55166666666666675,4.7190332326283987E-2,1.5003117579597011E-3,-0.1167410500299581,0.74594548104707803,0.02,8.4294738406658738E-4,-9.8575624242941695E-2,0.36524229090960836,3.8126888217522657E-2,1.4146993584543818E-3,-0.14653687322063075,0.65489538278759962,0,0,0,0,0,0,0,0,null,null,null,null,null,null,null,null,null,null,0,0]
[null,null,null,null,null,null,null,null,null,null," Brudlasttilfælde",null,{"$f":"Makro!B2","v":1},"Jævnt fordelt last, overside",null,null,"Bjælkereaktioner",null,"Vind",null,null,null,null,null,null,null,null,null,null,null,null,null,null,null,null,null,null,500,150,null,null,{"$f":"AP13","v":true},1,null,2,null,3,null,4,null,5,null,6,null,7,null,8,null,null,null,null,"I",0.65115634495708197,0.15,2.5862068965517242,2.75,0.13500000000000001,0.13500000000000001,2.5,2.5,true,0.75,0.5,1,8.3333333333333329E-2,0.83333333333333337,0.55166666666666675,0.55166666666666675,0.02,2.2499999999999999E-2,1.4999999999999999E-2,2.2499999999999999E-2,0.01,2.2499999999999999E-2,4.6999999999999999E-4,3.9294738406658739E-4,0.55166666666666675,1.6466666666666665,0.55166666666666675,4.7190332326283987E-2,1.5003117579597011E-3,-0.1167410500299581,0.74594548104707803,0.02,8.4294738406658738E-4,-9.8575624242941695E-2,0.36524229090960836,3.8126888217522657E-2,1.4146993584543818E-3,-0.14653687322063075,0.65489538278759962,0,0,0,0,0,0,0,0,null,null,null,null,null,null,null,null,null,null,0,0]
[null,null,null,null,null,null,null,null,null,null,null,null,null,"n1","n0","n2","NA","NB","w",null,null,null,null,null,null,null,null,null,null,null,null,null,null,null,null,null,null,1500,1500,1250,1000,{"$f":"AP14","v":true},false,null,true,null,true,null,true,null,true,null,false,null,false,null,false,null,null,null,"Felt 3",null,{"$f":"$R$13/1000","v":0.65115634495708197},{"$f":"$M$19/1000","v":0.15},{"$f":"$BD$107/1000","v":0.17647058823529413},{"$f":"($BD$11-$BD$10)/1000","v":0.5},{"$f":"($BD$16-$BD$17)/1000","v":0.13500000000000001},{"$f":"($BD$12-$BD$13)/1000","v":0.15},{"$f":"$BE$16/1000","v":2.5},{"$f":"$BE$13/1000","v":2.5},{"$f":"IF($BF$10=1000000,FALSE,TRUE)","v":false},{"$f":"BU19","v":0.5},{"$f":"IF(BS29,0.5*$BE$21/1000,IF(AND($AP$17,$AS$77=1),$BB$80,0))","v":0.6},{"$f":"BD105","v":1},{"$f":"BD109/M17","v":8.3333333333333329E-2},{"$f":"BD111/M17","v":8.3333333333333329E-2},{"$f":"BO29+BQ29/6","v":0.55166666666666675},{"$f":"BP29+BR29/6","v":0.56666666666666665},null,null,null,null,null,null,null,null,null,null,null,null,null,null,null,null,null,null,null,null,null,null,null,null,null,null,null,null,null,null,null,null,null,null,null,null,null,null,null,null,null,{"$f":"R13","v":651.15634495708196},{"$f":"MIN((($M$19/1000)^2*1000*$R$9/6+($M$19/6000)*DP29)*($DP$29-DP29)/$DP$29,(($M$19/1000)^2*1000*$R$8/6-($M$19/6000)*DP29)*($DP$29-DP29)/$DP$29)","v":0}]
[null,null,null,null,null,null,null,null,null,null,null,null,null,"(kN/m)","(kN/m)","(kN/m)","(kN)  ","(kN)  ","(kN/m2)",null,null,null,null,null,null,null,null,null,null,null,null,null,null,null,null,null,null,2500,1000,3250,null,{"$f":"AP15","v":false},false,null,false,null,true,null,true,null,false,null,true,null,true,null,false,null,null,null,"Lasttilfælde",{"$f":"K31","v":"A"},{"$f":"BK29","v":0.65115634495708197},{"$f":"BL29","v":0.15},{"$f":"BM29","v":0.17647058823529413},{"$f":"BN29","v":0.5},{"$f":"BO29","v":0.13500000000000001},{"$f":"BP29","v":0.15},{"$f":"BQ29","v":2.5},{"$f":"BR29","v":2.5},{"$f":"BS29","v":false},{"$f":"BT29","v":0.5},0.6,{"$f":"BV29","v":1},{"$f":"BW29","v":8.3333333333333329E-2},{"$f":"BX29","v":8.3333333333333329E-2},{"$f":"BY29","v":0.55166666666666675},{"$f":"BZ29","v":0.56666666666666665},{"$f":"CA20","v":3.0000000000000001E-3},{"$f":"CB20","v":4.4999999999999998E-2},{"$f":"CE20","v":1.5E-3},{"$f":"CF20","v":4.4999999999999998E-2},{"$f":"IF(BS30,BU30*CA30,BB84/1000)","v":1.7999999999999997E-3},{"$f":"IF(BS30,CB30,BC84/1000)","v":4.4999999999999998E-2},{"$f":"CG20","v":9.3999999999999997E-4},{"$f":"0.125*CG30*BM30^2","v":3.6591695501730111E-6},{"$f":"IF(BY30+BZ30<=BN30,BY30,MIN(IF(CC30=0,0,BN30*CC30/(CC30+CE30)),BY30))","v":0.22727272727272727},{"$f":"BN30-CI30-CK30","v":0},{"$f":"IF(BY30+BZ30<=BN30,BZ30,MIN(IF(CE30=0,0,BN30*CE30/(CC30+CE30)),BZ30))","v":0.27272727272727271},{"$f":"IF(CI30=0,0,CA30+CC30/CI30)","v":9.6000000000000009E-3},{"$f":"IF(BS20,IF(CI30=0,CB30*CA30,CB30*CA30+CD30*CC30/CI30)+CH30+IF(BV30=0,CG30*BT30*BM30*IF(BW30>1,0.27,BW30^-1/8-29*BW30^2/800+141*BW30/800)+CG30*BU30*BM30*IF(BX30>1.5,0,BX30^-1/8+2*BX30^2/27-BX30/6),IF(BW30<0.2,CG30*BT30*BM30*0.6*BW30,CG30*BT30*BM30*IF(BW30<1,(1125*BW30^3-3225*BW30^2+3075*BW30-111)/3200,0.27))),0)","v":4.3980622837370238E-4},{"$f":"CL30/($BL30)-6*($BK30/($BK30-CL30))*(CM30/$BL30^2)","v":-5.5036618127474707E-2},{"$f":"CL30/($BL30)+6*($BK30/($BK30-CL30))*(CM30/$BL30^2)","v":0.18303661812747474},{"$f":"IF(CJ30=0,CL30,CA30)","v":9.6000000000000009E-3},{"$f":"IF(CJ30=0,CM30,CB30*CA30+CH30+IF(BV30=0,CG30*(BT30+BU30)/BN30,0))","v":4.3980622837370238E-4},{"$f":"CP30/($BL30)-6*($BK30/($BK30-CP30))*(CQ30/$BL30^2)","v":-5.5036618127474707E-2},{"$f":"CP30/($BL30)+6*($BK30/($BK30-CP30))*(CQ30/$BL30^2)","v":0.18303661812747474},{"$f":"IF(CK30=0,0,CA30+CE30/CK30)","v":9.5999999999999992E-3},{"$f":"IF(BS20,IF(CK30=0,CB30*CA30,CB30*CA30+CE30*CF30/CK30)+CH30+IF(BV30=0,CG30*BU30*BM30*IF(BX30>1,0.27,BX30^-1/8-29*BX30^2/800+141*BX30/800)+CG30*BT30*BM30*IF(BW30>1.5,0,BW30^-1/8+2*BW30^2/27-BW30/6),IF(BX30<0.2,CG30*BU30*BM30*0.6*BX30,CG30*BU30*BM30*IF(BX30<1,(1125*BX30^3-3225*BX30^2+3075*BX30-111)/3200,0.27))),0)","v":4.4063564013840825E-4},{"$f":"CT30/($BL30)-6*($BK30/($BK30-CT30))*(CU30/$BL30^2)","v":-5.5261104196875799E-2},{"$f":"CT30/($BL30)+6*($BK30/($BK30-CT30))*(CU30/$BL30^2)","v":0.1832611041968758},{"$f":"IF($AM$113,IF(DA30=CN30,\"#3-venstre\",IF(DA30=CR30,\"#3-midt\",\"#3-højre\")),0)","v":0},{"$f":"IF($AM$113,IF(DA30=CN30,CL30,IF(DA30=CR30,CP30,CT30))*1000,0)","v":0},{"$f":"IF($AM$113,IF(DA30=CN30,CM30,IF(DA30=CR30,CQ30,CU30))*1000,0)","v":0},{"$f":"IF($AM$113,MIN(CN30,CR30,CV30),0)","v":0},{"$f":"IF($AM$113,IF(CX30=CO30,\"#3-venstre\",IF(CX30=CS30,\"#3-midt\",\"#3-højre\")),0)","v":0},{"$f":"IF($AM$113,IF(CX30=CO30,CL30,IF(CX30=CS30,CP30,CT30))*1000,0)","v":0},{"$f":"IF($AM$113,IF(CX30=CO30,CM30,IF(CX30=CS30,CQ30,CU30))*1000,0)","v":0},{"$f":"IF($AM$113,MAX(CO30,CS30,CW30),0)","v":0},null,null,null,null,null,null,null,null,null,null,{"$f":"DG10","v":0},null,{"$f":"DH10","v":0}]
[null,null,null,null,null,null,null,null,null,null,"A","Med maksimal vind",null,{"$f":"INDEX(Laste,ROW()-30+9*(2-$M$28),1)","v":3},{"$f":"INDEX(Laste,ROW()-30+9*(2-$M$28),2)","v":0},{"$f":"INDEX(Laste,ROW()-30+9*(2-$M$28),3)","v":0},{"$f":"AV84","v":2.4000000000000004},{"$f":"BD84","v":1.7999999999999998},0.94,null,null,null,null,null,null,null,null,null,null,null,null,null,null,null,null,null,null,1500,1000,5500,1000,{"$f":"AP16","v":true},false,null,false,null,false,null,true,null,true,null,false,null,true,null,true,null,null,null,null,{"$f":"K32","v":"B"},{"$f":"BK30","v":0.65115634495708197},0.15,{"$f":"BM30","v":0.17647058823529413},{"$f":"BN30","v":0.5},0.13500000000000001,0.15,2.5,2.5,false,0.5,0.6,1,8.3333333333333329E-2,8.3333333333333329E-2,0.55166666666666675,0.56666666666666665,4.0000000000000001E-3,4.4999999999999998E-2,{"$f":"CE21","v":2E-3},{"$f":"CF21","v":4.4999999999999998E-2},2.3999999999999998E-3,4.4999999999999998E-2,9.3999999999999997E-4,3.6591695501730111E-6,{"$f":"IF(BY31+BZ31<=BN31,BY31,MIN(IF(CC31=0,0,BN31*CC31/(CC31+CE31)),BY31))","v":0.22727272727272732},0,{"$f":"IF(BY31+BZ31<=BN31,BZ31,MIN(IF(CE31=0,0,BN31*CE31/(CC31+CE31)),BZ31))","v":0.27272727272727276},{"$f":"IF(CI31=0,0,CA31+CC31/CI31)","v":1.2799999999999999E-2},{"$f":"IF(BS21,IF(CI31=0,CB31*CA31,CB31*CA31+CD31*CC31/CI31)+CH31+IF(BV31=0,CG31*BT31*BM31*IF(BW31>1,0.27,BW31^-1/8-29*BW31^2/800+141*BW31/800)+CG31*BU31*BM31*IF(BX31>1.5,0,BX31^-1/8+2*BX31^2/27-BX31/6),IF(BW31<0.2,CG31*BT31*BM31*0.6*BW31,CG31*BT31*BM31*IF(BW31<1,(1125*BW31^3-3225*BW31^2+3075*BW31-111)/3200,0.27))),0)","v":5.838062283737023E-4},{"$f":"CL31/($BL31)-6*($BK31/($BK31-CL31))*(CM31/$BL31^2)","v":-7.3469977840901271E-2},{"$f":"CL31/($BL31)+6*($BK31/($BK31-CL31))*(CM31/$BL31^2)","v":0.24413664450756795},{"$f":"IF(CJ31=0,CL31,CA31)","v":1.2799999999999999E-2},{"$f":"IF(CJ31=0,CM31,CB31*CA31+CH31+IF(BV31=0,CG31*(BT31+BU31)/BN31,0))","v":5.838062283737023E-4},{"$f":"CP31/($BL31)-6*($BK31/($BK31-CP31))*(CQ31/$BL31^2)","v":-7.3469977840901271E-2},{"$f":"CP31/($BL31)+6*($BK31/($BK31-CP31))*(CQ31/$BL31^2)","v":0.24413664450756795},{"$f":"IF(CK31=0,0,CA31+CE31/CK31)","v":1.2799999999999999E-2},{"$f":"IF(BS21,IF(CK31=0,CB31*CA31,CB31*CA31+CE31*CF31/CK31)+CH31+IF(BV31=0,CG31*BU31*BM31*IF(BX31>1,0.27,BX31^-1/8-29*BX31^2/800+141*BX31/800)+CG31*BT31*BM31*IF(BW31>1.5,0,BW31^-1/8+2*BW31^2/27-BW31/6),IF(BX31<0.2,CG31*BU31*BM31*0.6*BX31,CG31*BU31*BM31*IF(BX31<1,(1125*BX31^3-3225*BX31^2+3075*BX31-111)/3200,0.27))),0)","v":5.8463564013840823E-4},{"$f":"CT31/($BL31)-6*($BK31/($BK31-CT31))*(CU31/$BL31^2)","v":-7.3695589230709638E-2},{"$f":"CT31/($BL31)+6*($BK31/($BK31-CT31))*(CU31/$BL31^2)","v":0.24436225589737631},{"$f":"IF($AM$113,IF(DA31=CN31,\"#3-venstre\",IF(DA31=CR31,\"#3-midt\",\"#3-højre\")),0)","v":0},{"$f":"IF($AM$113,IF(DA31=CN31,CL31,IF(DA31=CR31,CP31,CT31))*1000,0)","v":0},{"$f":"IF($AM$113,IF(DA31=CN31,CM31,IF(DA31=CR31,CQ31,CU31))*1000,0)","v":0},{"$f":"IF($AM$113,MIN(CN31,CR31,CV31),0)","v":0},{"$f":"IF($AM$113,IF(CX31=CO31,\"#3-venstre\",IF(CX31=CS31,\"#3-midt\",\"#3-højre\")),0)","v":0},{"$f":"IF($AM$113,IF(CX31=CO31,CL31,IF(CX31=CS31,CP31,CT31))*1000,0)","v":0},{"$f":"IF($AM$113,IF(CX31=CO31,CM31,IF(CX31=CS31,CQ31,CU31))*1000,0)","v":0},{"$f":"IF($AM$113,MAX(CO31,CS31,CW31),0)","v":0},null,null,null,null,null,null,null,null,null,null,{"$f":"DG11","v":0},null,null,{"$f":"DH11","v":0}]
[null,null,null,null,null,null,null,null,null,null,"B",null,null,4,0,0,{"$f":"AV85","v":3.2},{"$f":"BD85","v":2.4},{"$f":"S31","v":0.94},null,null,null,null,null,null,null,null,null,null,null,null,null,null,null,null,null,null,500,150,null,null,{"$f":"AP17","v":true},{"$f":"IF(AND(AQ29=$AP29,AQ30=$AP30,AQ31=$AP31),AQ28,1000)","v":1000},null,{"$f":"IF(AND(AS29=$AP29,AS30=$AP30,AS31=$AP31),AS28,1000)","v":1000},null,1000,null,1000,null,5,null,1000,null,1000,null,1000,null,null,null,null,"C",0.65115634495708197,0.15,0.17647058823529413,0.5,0.13500000000000001,0.15,2.5,2.5,false,0.5,0.6,1,8.3333333333333329E-2,8.3333333333333329E-2,0.55166666666666675,0.56666666666666665,1.6E-2,2.2499999999999999E-2,8.0000000000000002E-3,2.2499999999999999E-2,9.5999999999999992E-3,2.2499999999999999E-2,9.3999999999999997E-4,3.6591695501730111E-6,0.22727272727272732,0,0.27272727272727276,5.1199999999999996E-2,1.1598062283737023E-3,5.6577169881459888E-3,0.67700894967852066,5.1199999999999996E-2,1.1598062283737023E-3,5.6577169881459888E-3,0.67700894967852066,5.1199999999999996E-2,1.1606356401384081E-3,5.4176654187454432E-3,0.6772490012479212,0,0,0,0,0,0,0,0,null,null,null,null,null,null,null,null,null,null,0,null,null,null,{"$f":"DH12","v":0}]
[null,null,null,null,null,null,null,null,null,null,"C",null,null,4,12,0,12.8,9.6,{"$f":"S32","v":0.94},null,null,null,null,null,null,null,null,null,null,null,null,null,null,null,null,null,null,null,null,null,null,null,null,null,null,null,null,null,null,null,null,null,null,null,null,null,null,null,null,null,null,"D",0.65115634495708197,0.15,0.17647058823529413,0.5,0.13500000000000001,0.15,2.5,2.5,false,0.5,0.6,1,8.3333333333333329E-2,8.3333333333333329E-2,0.55166666666666675,0.56666666666666665,1.6E-2,2.2499999999999999E-2,8.0000000000000002E-3,2.2499999999999999E-2,9.5999999999999992E-3,2.2499999999999999E-2,9.3999999999999997E-4,3.6591695501730111E-6,0.22727272727272732,0,0.27272727272727276,5.1199999999999996E-2,1.1598062283737023E-3,5.6577169881459888E-3,0.67700894967852066,5.1199999999999996E-2,1.1598062283737023E-3,5.6577169881459888E-3,0.67700894967852066,5.1199999999999996E-2,1.1606356401384081E-3,5.4176654187454432E-3,0.6772490012479212,0,0,0,0,0,0,0,0,null,null,null,null,null,null,null,null,null,null,0,null,null,null,null,{"$f":"DH13","v":0}]
[null,null,null,null,null,null,null,null,null,null,"D",null,null,4,12,0,12.8,9.6,{"$f":"S33","v":0.94},null," NB:  Resultaterne skal altid kontrolleres af ansvarlig statiker",null,null,null,null,null,null,null,null,null,null,null,null,null,null,null,null,null,null,null,null,null,null,null,null,null,null,null,null,null,null,null,null,null,null,null,null,null,null,null,null,"E",0.65115634495708197,0.15,0.17647058823529413,0.5,0.13500000000000001,0.15,2.5,2.5,false,0.5,0.6,1,8.3333333333333329E-2,8.3333333333333329E-2,0.55166666666666675,0.56666666666666665,5.0000000000000001E-3,4.4999999999999998E-2,2.5000000000000001E-3,4.4999999999999998E-2,3.0000000000000001E-3,4.4999999999999998E-2,4.6999999999999999E-4,1.8295847750865055E-6,0.22727272727272729,0,0.27272727272727276,1.6E-2,7.2390311418685119E-4,-9.1236987419765755E-2,0.30457032075309909,1.6E-2,7.2390311418685119E-4,-9.1236987419765755E-2,0.30457032075309909,1.6E-2,7.243178200692041E-4,-9.1350361444383646E-2,0.30468369477771701,0,0,0,0,0,0,0,0,null,null,null,null,null,null,null,null,null,null,0,null,null,null,null,null,{"$f":"DH14","v":0}]
[null,null,null,null,null,null,null,null,null,null,"E","Med reduceret vind",null,5,0,0,4,3,0.47,null,null,null,null,null,null,null,null,null,null,null,null,null,null,null,null,null,null,null,null,null,null,null,null,null,null,null,null,null,null,null,null,null,null,null,null,null,null,null,null,null,null,"F",0.65115634495708197,0.15,0.17647058823529413,0.5,0.13500000000000001,0.15,2.5,2.5,false,0.5,0.6,1,8.3333333333333329E-2,8.3333333333333329E-2,0.55166666666666675,0.56666666666666665,1.7000000000000001E-2,2.3823529411764705E-2,8.5000000000000006E-3,2.3823529411764705E-2,1.0199999999999999E-2,2.3823529411764705E-2,4.6999999999999999E-4,1.8295847750865055E-6,0.22727272727272727,0,0.27272727272727271,5.4400000000000004E-2,1.2999031141868512E-3,-1.5573762741470154E-2,0.74090709607480354,5.4400000000000004E-2,1.2999031141868512E-3,-1.5573762741470154E-2,0.74090709607480354,5.4399999999999997E-2,1.3003178200692042E-3,-1.5694432143141257E-2,0.74102776547647453,0,0,0,0,0,0,0,0,null,null,null,null,null,null,null,null,null,null,0,null,null,null,null,null,null,{"$f":"DH15","v":0}]
[null,null,null,null,null,null,null,null,null,null,"F",null,null,5,12,0,13.600000000000001,10.199999999999999,{"$f":"S35","v":0.47},null,null,null,null,null,null,null,null,null,null,null,null,null,null,null,null,null,null,null,null,null,null,null,null,null,null,null,null,null,null,null,null,null,null,null,null,null,null,null,null,null,null,"G",0.65115634495708197,0.15,0.17647058823529413,0.5,0.13500000000000001,0.15,2.5,2.5,false,0.5,0.6,1,8.3333333333333329E-2,8.3333333333333329E-2,0.55166666666666675,0.56666666666666665,1.7000000000000001E-2,2.3823529411764705E-2,8.5000000000000006E-3,2.3823529411764705E-2,1.0199999999999999E-2,2.3823529411764705E-2,4.6999999999999999E-4,1.8295847750865055E-6,0.22727272727272727,0,0.27272727272727271,5.4400000000000004E-2,1.2999031141868512E-3,-1.5573762741470154E-2,0.74090709607480354,5.4400000000000004E-2,1.2999031141868512E-3,-1.5573762741470154E-2,0.74090709607480354,5.4399999999999997E-2,1.3003178200692042E-3,-1.5694432143141257E-2,0.74102776547647453,0,0,0,0,0,0,0,0,null,null,null,null,null,null,null,null,null,null,0,null,null,null,null,null,null,null,{"$f":"DH16","v":0}]
[null,null,null,null,null,null,null,null,null,null,"G",null,null,5,12,0,13.600000000000001,10.199999999999999,{"$f":"S36","v":0.47},null,"Vejledning:","Helvægge og dæk af letbeton; bærevene og stabilitet. Dansk Beton, Letbetongruppen - BIH",null,null,null,null,null,null,null,null,null,null,null,null,null,null,null,null,null,null,null,null,"x","y","x","y","x","y","x","y","x","y","x","y","x","y","x","y",null,null,null,"H",0.65115634495708197,0.15,0.17647058823529413,0.5,0.13500000000000001,0.15,2.5,2.5,false,0.5,0.6,1,8.3333333333333329E-2,8.3333333333333329E-2,0.55166666666666675,0.56666666666666665,0.02,2.2499999999999999E-2,0.01,2.2499999999999999E-2,1.2E-2,2.2499999999999999E-2,4.6999999999999999E-4,1.8295847750865055E-6,0.22727272727272729,0,0.27272727272727276,6.4000000000000001E-2,1.443903114186851E-3,-3.4358702185516288E-4,0.85367692035518861,6.4000000000000001E-2,1.443903114186851E-3,-3.4358702185516288E-4,0.85367692035518861,6.4000000000000001E-2,1.444317820069204E-3,-4.6622936696111283E-4,0.85379956270029456,0,0,0,0,0,0,0,0,null,null,null,null,null,null,null,null,null,null,0,null,null,null,null,null,null,null,null,{"$f":"DH17","v":0}]
[null,null,null,null,null,null,null,null,null,null,"H",null,null,5,15,0,16,12,{"$f":"S37","v":0.47},null,null,null,null,null,null,null,null,null,null,null,null,null,null,null,null,null,"VÆGFELT:",1,null,null,null,null,{"$f":"AR10","v":0},{"$f":"AS10","v":0},{"$f":"AR10","v":0},{"$f":"AS10","v":0},{"$f":"AS38","v":0},{"$f":"AT38","v":0},{"$f":"AS38","v":0},{"$f":"AT38","v":0},{"$f":"AS38","v":0},{"$f":"AT38","v":0},{"$f":"AS38","v":0},{"$f":"AT38","v":0},{"$f":"BA38","v":0},{"$f":"BB38","v":0},{"$f":"BC38","v":0},{"$f":"BD38","v":0},null,null,null,"I",0.65115634495708197,0.15,0.17647058823529413,0.5,0.13500000000000001,0.15,2.5,2.5,false,0.5,0.6,1,8.3333333333333329E-2,8.3333333333333329E-2,0.55166666666666675,0.56666666666666665,0.02,2.2499999999999999E-2,0.01,2.2499999999999999E-2,1.2E-2,2.2499999999999999E-2,4.6999999999999999E-4,1.8295847750865055E-6,0.22727272727272729,0,0.27272727272727276,6.4000000000000001E-2,1.443903114186851E-3,-3.4358702185516288E-4,0.85367692035518861,6.4000000000000001E-2,1.443903114186851E-3,-3.4358702185516288E-4,0.85367692035518861,6.4000000000000001E-2,1.444317820069204E-3,-4.6622936696111283E-4,0.85379956270029456,0,0,0,0,0,0,0,0,null,null,null,null,null,null,null,null,null,null,0,null,null,null,null,null,null,null,null,null,{"$f":"DH18","v":0}]
[null,null,null,null,null,null,null,null,null,null,"I",null,null,5,15,0,16,12,{"$f":"S38","v":0.47},null,null,null,null,null,null,null,null,null,null,null,null,null,null,null,null,null,null,null,null,null,null,null,{"$f":"AR15","v":7000},0,{"$f":"AV10","v":1250},{"$f":"AT38","v":0},1250,0,1250,0,1250,0,{"$f":"AR11","v":0},{"$f":"AT39","v":0},0,0,{"$f":"AT10","v":5500},0,null,null,"Felt 4",null,{"$f":"$R$13/1000","v":0.65115634495708197},{"$f":"$M$19/1000","v":0.15},{"$f":"$BF$107/1000","v":3},{"$f":"($BF$11-$BF$10)/1000","v":0},{"$f":"($BF$16-$BF$17)/1000","v":0},{"$f":"($BF$12-$BF$13)/1000","v":0},{"$f":"$BG$16/1000","v":1000},{"$f":"$BG$13/1000","v":1000},false,{"$f":"BU29","v":0.6},{"$f":"IF(AND($AP$17,$AS$77=1),$BB$80,0)","v":0.6},{"$f":"BF105","v":0},{"$f":"BF109/M17","v":0},{"$f":"BF111/M17","v":0},{"$f":"BO39+BQ39/6","v":166.66666666666666},{"$f":"BP39+BR39/6","v":166.66666666666666},null,null,null,null,null,null,null,null,null,null,null,null,null,null,null,null,null,null,null,null,null,null,null,null,null,null,null,null,null,null,null,null,null,null,null,null,null,null,null,null,null,{"$f":"DK10","v":0},null,null,null,null,null,null,null,null,null,null,{"$f":"DL10","v":0}]
[null,null,null,null,null,null,null,null,null,null," Excentricitet, top (mm):",null,null,60,15,45,null,null,null,null,null,null,null,null,null,null,null,null,null,null,null,null,null,null,null,null,null,null,null,null,null,null,7000,2500,{"$f":"AS39","v":1250},{"$f":"AW13","v":2500},1250,2500,1250,2500,1250,2500,{"$f":"BA39","v":0},{"$f":"AS12","v":0},0,0,{"$f":"BE39","v":5500},{"$f":"AU13","v":2500},null,null,"Lasttilfælde",{"$f":"K31","v":"A"},{"$f":"BK39","v":0.65115634495708197},{"$f":"BL39","v":0.15},{"$f":"BM39","v":3},{"$f":"BN39","v":0},{"$f":"BO39","v":0},{"$f":"BP39","v":0},{"$f":"BQ39","v":1000},{"$f":"BR39","v":1000},{"$f":"BS39","v":false},{"$f":"BT39","v":0.6},{"$f":"BU39","v":0.6},{"$f":"BV39","v":0},{"$f":"BW39","v":0},{"$f":"BX39","v":0},{"$f":"BY39","v":166.66666666666666},{"$f":"BZ39","v":166.66666666666666},{"$f":"CA30","v":3.0000000000000001E-3},{"$f":"CB30","v":4.4999999999999998E-2},{"$f":"CE30","v":1.7999999999999997E-3},{"$f":"CF30","v":4.4999999999999998E-2},{"$f":"BB84/1000","v":1.7999999999999997E-3},{"$f":"BC84/1000","v":4.4999999999999998E-2},{"$f":"CG30","v":9.3999999999999997E-4},{"$f":"0.125*CG40*BM40^2","v":1.0575000000000001E-3},{"$f":"IF(BY40+BZ40<=BN40,BY40,MIN(IF(CC40=0,0,BN40*CC40/(CC40+CE40)),BY40))","v":0},{"$f":"BN40-CI40-CK40","v":0},{"$f":"IF(BY40+BZ40<=BN40,BZ40,MIN(IF(CE40=0,0,BN40*CE40/(CC40+CE40)),BZ40))","v":0},{"$f":"IF(CI40=0,0,CA40+CC40/CI40)","v":0},{"$f":"IF(BS30,IF(CI40=0,CB40*CA40,CB40*CA40+CD40*CC40/CI40)+CH40+IF(BV40=0,CG40*BT40*BM40*IF(BW40>1,0.27,BW40^-1/8-29*BW40^2/800+141*BW40/800)+CG40*BU40*BM40*IF(BX40>1.5,0,BX40^-1/8+2*BX40^2/27-BX40/6),IF(BW40<0.2,CG40*BT40*BM40*0.6*BW40,CG40*BT40*BM40*IF(BW40<1,(1125*BW40^3-3225*BW40^2+3075*BW40-111)/3200,0.27))),0)","v":0},{"$f":"CL40/($BL40)-6*($BK40/($BK40-CL40))*(CM40/$BL40^2)","v":0},{"$f":"CL40/($BL40)+6*($BK40/($BK40-CL40))*(CM40/$BL40^2)","v":0},{"$f":"IF(CJ40=0,CL40,CA40)","v":0},{"$f":"IF(CJ40=0,CM40,CB40*CA40+CH40+IF(BV40=0,CG40*(BT40+BU40)/BN40,0))","v":0},{"$f":"CP40/($BL40)-6*($BK40/($BK40-CP40))*(CQ40/$BL40^2)","v":0},{"$f":"CP40/($BL40)+6*($BK40/($BK40-CP40))*(CQ40/$BL40^2)","v":0},{"$f":"IF(CK40=0,0,CA40+CE40/CK40)","v":0},{"$f":"IF(BS30,IF(CK40=0,CB40*CA40,CB40*CA40+CE40*CF40/CK40)+CH40+IF(BV40=0,CG40*BU40*BM40*IF(BX40>1,0.27,BX40^-1/8-29*BX40^2/800+141*BX40/800)+CG40*BT40*BM40*IF(BW40>1.5,0,BW40^-1/8+2*BW40^2/27-BW40/6),IF(BX40<0.2,CG40*BU40*BM40*0.6*BX40,CG40*BU40*BM40*IF(BX40<1,(1125*BX40^3-3225*BX40^2+3075*BX40-111)/3200,0.27))),0)","v":0},{"$f":"CT40/($BL40)-6*($BK40/($BK40-CT40))*(CU40/$BL40^2)","v":0},{"$f":"CT40/($BL40)+6*($BK40/($BK40-CT40))*(CU40/$BL40^2)","v":0},{"$f":"IF($AM$113,IF(DA40=CN40,\"#4-venstre\",IF(DA40=CR40,\"#4-midt\",\"#4-højre\")),0)","v":0},{"$f":"IF($AM$113,IF(DA40=CN40,CL40,IF(DA40=CR40,CP40,CT40))*1000,0)","v":0},{"$f":"IF($AM$113,IF(DA40=CN40,CM40,IF(DA40=CR40,CQ40,CU40))*1000,0)","v":0},{"$f":"IF($AM$113,MIN(CN40,CR40,CV40),0)","v":0},{"$f":"IF($AM$113,IF(CX40=CO40,\"#4-venstre\",IF(CX40=CS40,\"#4-midt\",\"#4-højre\")),0)","v":0},{"$f":"IF($AM$113,IF(CX40=CO40,CL40,IF(CX40=CS40,CP40,CT40))*1000,0)","v":0},{"$f":"IF($AM$113,IF(CX40=CO40,CM40,IF(CX40=CS40,CQ40,CU40))*1000,0)","v":0},{"$f":"IF($AM$113,MAX(CO40,CS40,CW40),0)","v":0},null,null,null,null,null,null,null,null,null,null,{"$f":"DK11","v":0},null,null,null,null,null,null,null,null,null,null,null,{"$f":"DL11","v":0}]
[null,null,null,null,null,null,null,null,null,null," Excentricitet, eff. (mm) :",null,null,{"$f":"2*N40/3+$R$11","v":45},{"$f":"2*O40/3+$R$11","v":15},{"$f":"2*P40/3-$R$11","v":25},null,null,null,null,"Polyteknisk Forlag 2010 eller www.bef.dk",null,null,null,null,null,null,null,null,null,null,null,null,null,null,null,null,null,null,null,null,null,6850,2500,{"$f":"AS40-$AO$20","v":1115},{"$f":"AT40","v":2500},1115,2500,1115,2500,1115,2500,{"$f":"BA40-$AO$20","v":-135},{"$f":"BB40","v":0},-135,0,{"$f":"BE40-$AO$20","v":5365},{"$f":"BF40","v":2500},null,null,null,{"$f":"K32","v":"B"},{"$f":"BK40","v":0.65115634495708197},0.15,{"$f":"BM40","v":3},{"$f":"BN40","v":0},0,0,1000,1000,false,0.6,0.6,0,0,0,166.66666666666666,166.66666666666666,4.0000000000000001E-3,4.4999999999999998E-2,{"$f":"CE31","v":2.3999999999999998E-3},{"$f":"CF31","v":4.4999999999999998E-2},{"$f":"BB85/1000","v":2.3999999999999998E-3},{"$f":"BC85/1000","v":4.4999999999999998E-2},9.3999999999999997E-4,1.0575000000000001E-3,{"$f":"IF(BY41+BZ41<=BN41,BY41,MIN(IF(CC41=0,0,BN41*CC41/(CC41+CE41)),BY41))","v":0},0,{"$f":"IF(BY41+BZ41<=BN41,BZ41,MIN(IF(CE41=0,0,BN41*CE41/(CC41+CE41)),BZ41))","v":0},{"$f":"IF(CI41=0,0,CA41+CC41/CI41)","v":0},{"$f":"IF(BS31,IF(CI41=0,CB41*CA41,CB41*CA41+CD41*CC41/CI41)+CH41+IF(BV41=0,CG41*BT41*BM41*IF(BW41>1,0.27,BW41^-1/8-29*BW41^2/800+141*BW41/800)+CG41*BU41*BM41*IF(BX41>1.5,0,BX41^-1/8+2*BX41^2/27-BX41/6),IF(BW41<0.2,CG41*BT41*BM41*0.6*BW41,CG41*BT41*BM41*IF(BW41<1,(1125*BW41^3-3225*BW41^2+3075*BW41-111)/3200,0.27))),0)","v":0},{"$f":"CL41/($BL41)-6*($BK41/($BK41-CL41))*(CM41/$BL41^2)","v":0},{"$f":"CL41/($BL41)+6*($BK41/($BK41-CL41))*(CM41/$BL41^2)","v":0},{"$f":"IF(CJ41=0,CL41,CA41)","v":0},{"$f":"IF(CJ41=0,CM41,CB41*CA41+CH41+IF(BV41=0,CG41*(BT41+BU41)/BN41,0))","v":0},{"$f":"CP41/($BL41)-6*($BK41/($BK41-CP41))*(CQ41/$BL41^2)","v":0},{"$f":"CP41/($BL41)+6*($BK41/($BK41-CP41))*(CQ41/$BL41^2)","v":0},{"$f":"IF(CK41=0,0,CA41+CE41/CK41)","v":0},{"$f":"IF(BS31,IF(CK41=0,CB41*CA41,CB41*CA41+CE41*CF41/CK41)+CH41+IF(BV41=0,CG41*BU41*BM41*IF(BX41>1,0.27,BX41^-1/8-29*BX41^2/800+141*BX41/800)+CG41*BT41*BM41*IF(BW41>1.5,0,BW41^-1/8+2*BW41^2/27-BW41/6),IF(BX41<0.2,CG41*BU41*BM41*0.6*BX41,CG41*BU41*BM41*IF(BX41<1,(1125*BX41^3-3225*BX41^2+3075*BX41-111)/3200,0.27))),0)","v":0},{"$f":"CT41/($BL41)-6*($BK41/($BK41-CT41))*(CU41/$BL41^2)","v":0},{"$f":"CT41/($BL41)+6*($BK41/($BK41-CT41))*(CU41/$BL41^2)","v":0},{"$f":"IF($AM$113,IF(DA41=CN41,\"#4-venstre\",IF(DA41=CR41,\"#4-midt\",\"#4-højre\")),0)","v":0},{"$f":"IF($AM$113,IF(DA41=CN41,CL41,IF(DA41=CR41,CP41,CT41))*1000,0)","v":0},{"$f":"IF($AM$113,IF(DA41=CN41,CM41,IF(DA41=CR41,CQ41,CU41))*1000,0)","v":0},{"$f":"IF($AM$113,MIN(CN41,CR41,CV41),0)","v":0},{"$f":"IF($AM$113,IF(CX41=CO41,\"#4-venstre\",IF(CX41=CS41,\"#4-midt\",\"#4-højre\")),0)","v":0},{"$f":"IF($AM$113,IF(CX41=CO41,CL41,IF(CX41=CS41,CP41,CT41))*1000,0)","v":0},{"$f":"IF($AM$113,IF(CX41=CO41,CM41,IF(CX41=CS41,CQ41,CU41))*1000,0)","v":0},{"$f":"IF($AM$113,MAX(CO41,CS41,CW41),0)","v":0},null,null,null,null,null,null,null,null,null,null,0,null,null,null,null,null,null,null,null,null,null,null,null,{"$f":"DL12","v":0}]
[null,null,null,null,null,null,null,null,null,null,null,null,null,null,null,null,null,null,null,null,null,null,null,null,null,null,null,null,null,null,null,null,null,null,null,null,null,null,null,null,null,null,6850,3000,{"$f":"AS41","v":1115},{"$f":"AR42","v":3000},1115,3000,1115,3000,1115,3000,{"$f":"BA41","v":-135},{"$f":"AT42","v":3000},-135,3000,{"$f":"BE41","v":5365},3000,null,null,null,"C",0.65115634495708197,0.15,3,0,0,0,1000,1000,false,0.6,0.6,0,0,0,166.66666666666666,166.66666666666666,1.6E-2,2.2499999999999999E-2,9.5999999999999992E-3,2.2499999999999999E-2,9.5999999999999992E-3,2.2499999999999999E-2,9.3999999999999997E-4,1.0575000000000001E-3,0,0,0,0,0,0,0,0,0,0,0,0,0,0,0,0,0,0,0,0,0,0,0,null,null,null,null,null,null,null,null,null,null,0,null,null,null,null,null,null,null,null,null,null,null,null,null,{"$f":"DL13","v":0}]
[null,null,null,null,null,null,null,null,null,null,null,null,null,null,null,null,null,null,null,null,null,null,null,null,null,null,null,null,null,null,null,null,null,null,null,null,null,null,null,null,null,null,150,3000,{"$f":"AQ43","v":150},{"$f":"AR43","v":3000},150,3000,150,3000,150,3000,{"$f":"AS43","v":150},3000,150,3000,{"$f":"BC43","v":150},3000,null,null,null,"D",0.65115634495708197,0.15,3,0,0,0,1000,1000,false,0.6,0.6,0,0,0,166.66666666666666,166.66666666666666,1.6E-2,2.2499999999999999E-2,9.5999999999999992E-3,2.2499999999999999E-2,9.5999999999999992E-3,2.2499999999999999E-2,9.3999999999999997E-4,1.0575000000000001E-3,0,0,0,0,0,0,0,0,0,0,0,0,0,0,0,0,0,0,0,0,0,0,0,null,null,null,null,null,null,null,null,null,null,0,null,null,null,null,null,null,null,null,null,null,null,null,null,null,{"$f":"DL14","v":0}]
[null,null,null,null,null,null,null,null,null,null,null,null,null,null,null,null,null,null,null,null,null,null,null,null,null,null,null,null,null,null,null,null,null,null,null,null,null,null,null,null,null,null,150,2500,{"$f":"AQ44","v":150},{"$f":"AR44","v":2500},150,2500,150,2500,150,2500,{"$f":"AS44","v":150},2500,150,2500,{"$f":"BC44","v":150},2500,null,null,null,"E",0.65115634495708197,0.15,3,0,0,0,1000,1000,false,0.6,0.6,0,0,0,166.66666666666666,166.66666666666666,5.0000000000000001E-3,4.4999999999999998E-2,3.0000000000000001E-3,4.4999999999999998E-2,3.0000000000000001E-3,4.4999999999999998E-2,4.6999999999999999E-4,5.2875000000000003E-4,0,0,0,0,0,0,0,0,0,0,0,0,0,0,0,0,0,0,0,0,0,0,0,null,null,null,null,null,null,null,null,null,null,0,null,null,null,null,null,null,null,null,null,null,null,null,null,null,null,{"$f":"DL15","v":0}]
[null,null,null,null,null,null,null,null,null,null,null,null,null,null,null,null,null,null,null,null,null,null,null,null,null,null,null,null,null,null,null,null,null,null,null,null,null,null,null,null,null,null,0,2500,{"$f":"AQ45","v":0},{"$f":"AR45","v":2500},0,2500,0,2500,0,2500,{"$f":"AS45","v":0},2500,0,2500,{"$f":"BC45","v":0},2500,null,null,null,"F",0.65115634495708197,0.15,3,0,0,0,1000,1000,false,0.6,0.6,0,0,0,166.66666666666666,166.66666666666666,1.7000000000000001E-2,2.3823529411764705E-2,1.0199999999999999E-2,2.3823529411764705E-2,1.0199999999999999E-2,2.3823529411764705E-2,4.6999999999999999E-4,5.2875000000000003E-4,0,0,0,0,0,0,0,0,0,0,0,0,0,0,0,0,0,0,0,0,0,0,0,null,null,null,null,null,null,null,null,null,null,0,null,null,null,null,null,null,null,null,null,null,null,null,null,null,null,null,{"$f":"DL16","v":0}]
[null,null,null,null,null,null,null,null,null,null,null,null,null,null,null,null,null,null,null,null,null,null,null,null,null,null,null,null,null,null,null,null,null,null,null,null,null,null,null,null,null,null,0,0,{"$f":"AQ46","v":0},{"$f":"AR46","v":0},0,0,0,0,0,0,{"$f":"AS46","v":0},0,0,0,{"$f":"BC46","v":0},0,null,null,null,"G",0.65115634495708197,0.15,3,0,0,0,1000,1000,false,0.6,0.6,0,0,0,166.66666666666666,166.66666666666666,1.7000000000000001E-2,2.3823529411764705E-2,1.0199999999999999E-2,2.3823529411764705E-2,1.0199999999999999E-2,2.3823529411764705E-2,4.6999999999999999E-4,5.2875000000000003E-4,0,0,0,0,0,0,0,0,0,0,0,0,0,0,0,0,0,0,0,0,0,0,0,null,null,null,null,null,null,null,null,null,null,0,null,null,null,null,null,null,null,null,null,null,null,null,null,null,null,null,null,{"$f":"DL17","v":0}]
[null,null,null,null,null,null,null,null,null,null,null,null,null,null,null,null,null,null,null,null,null,null,null,null,null,null,null,null,null,null,null,null,null,null,null,null,"VÆGFELT:",2,null,null,null,null,1000000,1000000,{"$f":"AV11","v":2750},0,{"$f":"AV11","v":2750},0,{"$f":"AU47","v":2750},{"$f":"AV47","v":0},{"$f":"AV11","v":2750},0,{"$f":"AR14","v":0},0,0,0,{"$f":"AT11","v":6500},0,null,null,null,"H",0.65115634495708197,0.15,3,0,0,0,1000,1000,false,0.6,0.6,0,0,0,166.66666666666666,166.66666666666666,0.02,2.2499999999999999E-2,1.2E-2,2.2499999999999999E-2,1.2E-2,2.2499999999999999E-2,4.6999999999999999E-4,5.2875000000000003E-4,0,0,0,0,0,0,0,0,0,0,0,0,0,0,0,0,0,0,0,0,0,0,0,null,null,null,null,null,null,null,null,null,null,0,null,null,null,null,null,null,null,null,null,null,null,null,null,null,null,null,null,null,{"$f":"DL18","v":0}]
[null,null,null,null,null,null,null,null,null,null,null,null,null,null,null,null,null,null,null,null,null,null,null,null,null,null,null,null,null,null,null,null,null,null,null,null,null,null,null,null,null,null,1000000,1000000,{"$f":"AR15","v":7000},0,{"$f":"AR11","v":0},{"$f":"AS11","v":0},0,0,{"$f":"AT10","v":5500},0,{"$f":"AS48","v":7000},0,{"$f":"AY48","v":5500},0,{"$f":"AS48","v":7000},0,null,null,null,"I",0.65115634495708197,0.15,3,0,0,0,1000,1000,false,0.6,0.6,0,0,0,166.66666666666666,166.66666666666666,0.02,2.2499999999999999E-2,1.2E-2,2.2499999999999999E-2,1.2E-2,2.2499999999999999E-2,4.6999999999999999E-4,5.2875000000000003E-4,0,0,0,0,0,0,0,0,0,0,0,0,0,0,0,0,0,0,0,0,0,0,0]
[null,null,null,null,null,null,null,null,null,null,null,null,null,null,null,null,null,null,null,null,null,null,null,null,null,null,null,null,null,null,null,null,null,null,null,null,null,null,null,null,null,null,1000000,1000000,7000,2500,{"$f":"AU48","v":0},{"$f":"AS12","v":0},0,0,{"$f":"AY48","v":5500},{"$f":"AU13","v":2500},7000,2500,5500,2500,7000,2500]
[null,null,null,null,null,null,null,null,null,null,null,null,null,null,null,null,null,null,null,null,null,null,null,null,null,null,null,null,null,null,null,null,null,null,null,null,null,null,null,null,null,null,1000000,1000000,6850,2500,{"$f":"AU49-$AO$20","v":-135},{"$f":"AV49","v":0},-135,0,{"$f":"AY49-$AO$20","v":5365},{"$f":"AZ49","v":2500},6850,2500,5365,2500,6850,2500]
[null,null,null,null,null,null,null,null,null,null,null,null,null,null,null,null,null,null,null,null,null,null,null,null,null,null,null,null,null,null,null,null,null,null,null,null,null,null,null,null,null,null,1000000,1000000,6850,3000,{"$f":"AU50","v":-135},{"$f":"AT51","v":3000},-135,3000,{"$f":"AY50","v":5365},{"$f":"AX51","v":3000},6850,3000,5365,3000,6850,3000]
[null,null,null,null,null,null,null,null,null,null,null,null,null,null,null,null,null,null,null,null,null,null,null,null,null,null,null,null,null,null,null,null,null,null,null,null,null,null,null,null,null,null,1000000,1000000,{"$f":"AS47+$AO$20","v":2885},{"$f":"AT51","v":3000},{"$f":"AS52","v":2885},{"$f":"AT52","v":3000},2885,3000,{"$f":"AS52","v":2885},3000,{"$f":"AR13+$AO$20","v":135},{"$f":"BB51","v":3000},{"$f":"BA52","v":135},3000,{"$f":"BE47+$AO$20","v":6635},{"$f":"BF51","v":3000}]
[null,null,null,null,null,null,null,null,null,null,null,null,null,null,null,null,null,null,null,null,null,null,null,null,null,null,null,null,null,null,null,null,null,null,null,null,null,null,null,null,null,null,1000000,1000000,{"$f":"AS52","v":2885},{"$f":"AW12","v":2500},{"$f":"AS53","v":2885},{"$f":"AT53","v":2500},2885,2500,2885,2500,{"$f":"BA52","v":135},{"$f":"AS13","v":0},135,0,{"$f":"BE52","v":6635},{"$f":"AU12","v":2500},null,null,null,null,null,null,null,null,null,null,null,null,null,null,null,null,null,null,null,null,null,null,null,null,null,null,null,null,"Lodret bæreevne",null,null,"Venstre",null,null,null,"Midt",null,null,null,"Højre",null,null,null,"Kontrol"]
[null,null,null,null,null,null,null,null,null,null,null,null,null,null,null,null,null,null,null,null,null,null,null,null,null,null,null,null,null,null,null,null,null,null,null,null,null,null,null,null,null,null,1000000,1000000,{"$f":"AS53-$AO$20","v":2750},{"$f":"AT53","v":2500},{"$f":"AS54","v":2750},{"$f":"AT54","v":2500},2750,2500,2750,2500,{"$f":"BA53-$AO$20","v":0},{"$f":"BB53","v":0},0,0,{"$f":"BE53-$AO$20","v":6500},{"$f":"BF53","v":2500},null,null,null,null,null,null,null,null,null,null,null,null,null,null,null,null,null,null,null,null,null,null,null,null,null,null,null,null,"fck",{"$f":"M9","v":10},"FELT #1: ","n-s1","e-t1","ks","rd","n-s0","e-t0","ks","rd","n-s2","e-t2","ks","rd",{"$f":"MAX(CX55:CX63)","v":0},{"$f":"IF(MAX(CX55:CX63)=0,\"\",CK54&\"Last \"&CY55&CY56&CY57&CY58&CY59&CY60&CY61&CY62&CY63)","v":""}]
[null,null,null,null,null,null,null,null,null,null,null,null,null,null,null,null,null,null,null,null,null,null,null,null,null,null,null,null,null,null,null,null,null,null,null,null,null,null,null,null,null,null,1000000,1000000,{"$f":"AS47","v":2750},{"$f":"AT47","v":0},{"$f":"AS55","v":2750},{"$f":"AT55","v":0},2750,0,2750,0,{"$f":"BA47","v":0},{"$f":"BB47","v":0},0,0,{"$f":"BE47","v":6500},{"$f":"BF47","v":0},null,null,null,null,null,null,null,null,null,null,null,null,null,null,null,null,null,null,null,null,null,null,null,null,null,null,null,null,"Ecm",{"$f":"M11","v":14422.248751453108},"A, ",{"$f":"IF(CI10=0,0,CA10+CC10/CI10)*1000","v":7.2352941176470598},{"$f":"IF(CL55=0,0,IF(CI10=0,0,CB10*CA10+CD10*CC10/CI10)/CL55)*1000000","v":44.999999999999993},{"$f":"IF($CJ$60-2*CM55<=0,0,1/(1+12*($CJ$54/($CJ$55*PI()^2)*($CJ$56/($CJ$60-2*CM55))^2)))","v":0.32179156676997123},{"$f":"CN55*($CJ$60-2*CM55)*$R$8","v":124.56447745934373},{"$f":"IF(CJ10=0,0,CA10)*1000","v":3},{"$f":"IF(CP55=0,0,IF(CJ10=0,0,CB10*CA10)/CP55)*1000000","v":45},{"$f":"IF($CJ$60-2*CQ55<=0,0,1/(1+12*($CJ$54/($CJ$55*PI()^2)*($CJ$56/($CJ$60-2*CQ55))^2)))","v":0.32179156676997112},{"$f":"CR55*($CJ$60-2*CQ55)*$R$8","v":124.56447745934366},{"$f":"IF(CK10=0,0,CA10+CE10/CK10)*1000","v":7.0785498489425986},{"$f":"IF(CT55=0,0,IF(CK10=0,0,CB10*CA10+CF10*CE10/CK10)/CT55)*1000000","v":44.999999999999993},{"$f":"IF($CJ$60-2*CU55<=0,0,1/(1+12*($CJ$54/($CJ$55*PI()^2)*($CJ$56/($CJ$60-2*CU55))^2)))","v":0.32179156676997123},{"$f":"CV55*($CJ$60-2*CU55)*$R$8","v":124.56447745934373},{"$f":"IF(OR(CL55>CO55,CP55>CS55,CT55>CW55),1,0)","v":0},{"$f":"IF(CX55=0,\"\",CK55)","v":""}]
[null,null,null,null,null,null,null,null,null,null,null,null,null,null,null,null,null,null,null,null,null,null,null,null,null,null,null,null,null,null,null,null,null,null,null,null,"VÆGFELT:",3,null,null,null,null,1000000,1000000,1000000,1000000,{"$f":"BA47","v":0},{"$f":"BB47","v":0},{"$f":"BC47","v":0},{"$f":"BD47","v":0},{"$f":"BE47","v":6500},{"$f":"BF47","v":0},1000000,1000000,{"$f":"AY56","v":6500},{"$f":"AZ56","v":0},1000000,1000000,null,null,null,null,null,null,null,null,null,null,null,null,null,null,null,null,null,null,null,null,null,null,null,null,null,null,null,null,"L #1",{"$f":"$R$10","v":3000},"B, ",{"$f":"IF(CI11=0,0,CA11+CC11/CI11)*1000","v":9.6470588235294112},{"$f":"IF(CL56=0,0,IF(CI11=0,0,CB11*CA11+CD11*CC11/CI11)/CL56)*1000000","v":45},0.32179156676997112,124.56447745934366,{"$f":"IF(CJ11=0,0,CA11)*1000","v":4},{"$f":"IF(CP56=0,0,IF(CJ11=0,0,CB11*CA11)/CP56)*1000000","v":44.999999999999993},0.32179156676997123,124.56447745934373,{"$f":"IF(CK11=0,0,CA11+CE11/CK11)*1000","v":9.4380664652567976},{"$f":"IF(CT56=0,0,IF(CK11=0,0,CB11*CA11+CF11*CE11/CK11)/CT56)*1000000","v":44.999999999999993},0.32179156676997123,124.56447745934373,{"$f":"IF(OR(CL56>CO56,CP56>CS56,CT56>CW56),1,0)","v":0},{"$f":"IF(CX56=0,\"\",CK56)","v":""}]
[null,null,null,null,null,null,null,null,null,null,null,null,null,null,null,null,null,null,null,null,null,null,null,null,null,null,null,null,null,null,null,null,null,null,null,null,null,null,null,null,null,null,1000000,1000000,1000000,1000000,7000,0,5500,0,7000,0,1000000,1000000,{"$f":"AY57","v":7000},0,1000000,1000000,null,null,null,null,null,null,null,null,null,null,null,null,null,null,null,null,null,null,null,null,null,null,null,null,null,null,null,null,"L #2",{"$f":"CJ56","v":3000},"C, ",38.588235294117645,22.5,0.59234812280486482,401.2680831903923,16,22.499999999999996,0.59234812280486482,401.2680831903923,37.75226586102719,22.499999999999996,0.59234812280486482,401.2680831903923,0,""]
[null,null,null,null,null,null,null,null,null,null,null,null,null,null,null,null,null,null,null,null,null,null,null,null,null,null,null,null,null,null,null,null,null,null,null,null,null,null,null,null,null,null,1000000,1000000,1000000,1000000,7000,2500,5500,2500,7000,2500,1000000,1000000,7000,2500,1000000,1000000,null,null,null,null,null,null,null,null,null,null,null,null,null,null,null,null,null,null,null,null,null,null,null,null,null,null,null,null,"L #3",{"$f":"CJ56","v":3000},"D, ",38.588235294117645,22.5,0.59234812280486482,401.2680831903923,16,22.499999999999996,0.59234812280486482,401.2680831903923,37.75226586102719,22.499999999999996,0.59234812280486482,401.2680831903923,0,""]
[null,null,null,null,null,null,null,null,null,null,null,null,null,null,null,null,null,null,null,null,null,null,null,null,null,null,null,null,null,null,null,null,null,null,null,null,null,null,null,null,null,null,1000000,1000000,1000000,1000000,6850,2500,5365,2500,6850,2500,1000000,1000000,6850,2500,1000000,1000000,null,null,null,null,null,null,null,null,null,null,null,null,null,null,null,null,null,null,null,null,null,null,null,null,null,null,null,null,"L #4",{"$f":"CJ56","v":3000},"E, ",12.058823529411764,45,0.32179156676997112,124.56447745934366,5,44.999999999999993,0.32179156676997123,124.56447745934373,11.797583081570997,44.999999999999993,0.32179156676997123,124.56447745934373,0,""]
[null,null,null,null,null,null,null,null,null,null,null,null,null,null,null,null,null,null,null,null,null,null,null,null,null,null,null,null,null,null,null,null,null,null,null,null,null,null,null,null,null,null,1000000,1000000,1000000,1000000,6850,3000,5365,3000,6850,3000,1000000,1000000,6850,3000,1000000,1000000,null,null,null,null,null,null,null,null,null,null,null,null,null,null,null,null,null,null,null,null,null,null,null,null,null,null,null,null,"t",{"$f":"M19","v":150},"F, ",41.000000000000007,23.823529411764703,0.57996125323187198,382.9725163656384,17,23.823529411764707,0.57996125323187175,382.97251636563817,40.111782477341386,23.82352941176471,0.57996125323187175,382.97251636563817,0,""]
[null,null,null,null,null,null,null,null,null,null,null,null,null,null,null,null,null,null,null,null,null,null,null,null,null,null,null,null,null,null,null,null,null,null,null,null,null,null,null,null,null,null,1000000,1000000,1000000,1000000,135,3000,135,3000,6635,3000,1000000,1000000,6635,3000,1000000,1000000,null,null,null,null,null,null,null,null,null,null,null,null,null,null,null,null,null,null,null,null,null,null,null,null,null,null,null,null,"Ac",{"$f":"CJ60","v":150},"G, ",41.000000000000007,23.823529411764703,0.57996125323187198,382.9725163656384,17,23.823529411764707,0.57996125323187175,382.97251636563817,40.111782477341386,23.82352941176471,0.57996125323187175,382.97251636563817,0,""]
[null,null,null,null,null,null,null,null,null,null,null,null,null,null,null,null,null,null,null,null,null,null,null,null,null,null,null,null,null,null,null,null,null,null,null,null,null,null,null,null,null,null,1000000,1000000,1000000,1000000,135,0,135,0,6635,2500,1000000,1000000,6635,2500,1000000,1000000,null,null,null,null,null,null,null,null,null,null,null,null,null,null,null,null,null,null,null,null,null,null,null,null,null,null,null,null,null,null,"H, ",48.235294117647058,22.5,0.59234812280486482,401.2680831903923,20,22.499999999999996,0.59234812280486482,401.2680831903923,47.190332326283986,22.499999999999996,0.59234812280486482,401.2680831903923,0,""]
[null,null,null,null,null,null,null,null,null,null,null,null,null,null,null,null,null,null,null,null,null,null,null,null,null,null,null,null,null,null,null,null,null,null,null,null,null,null,null,null,null,null,1000000,1000000,1000000,1000000,0,0,0,0,6500,2500,1000000,1000000,6500,2500,1000000,1000000,null,null,null,null,null,null,null,null,null,null,null,null,null,null,null,null,null,null,null,null,null,null,null,null,null,null,null,null,null,null,"I, ",48.235294117647058,22.5,0.59234812280486482,401.2680831903923,20,22.499999999999996,0.59234812280486482,401.2680831903923,47.190332326283986,22.499999999999996,0.59234812280486482,401.2680831903923,0,""]
[null,null,null,null,null,null,null,null,null,null,null,null,null,null,null,null,null,null,null,null,null,null,null,null,null,null,null,null,null,null,null,null,null,null,null,null,null,null,null,null,null,null,1000000,1000000,1000000,1000000,0,0,0,0,6500,0,1000000,1000000,6500,0,1000000,1000000,null,null,null,null,null,null,null,null,null,null,null,null,null,null,null,null,null,null,null,null,null,null,null,null,null,null,null,null,null,null,"FELT #2: ",null,null,null,null,null,null,null,null,null,null,null,null,{"$f":"MAX(CX65:CX73)","v":0},{"$f":"IF(MAX(CX65:CX73)=0,\"\",CK64&\"Last \"&CY65&CY66&CY67&CY68&CY69&CY70&CY71&CY72&CY73)","v":""}]
[null,null,null,null,null,null,null,null,null,null,null,null,null,null,null,null,null,null,null,null,null,null,null,null,null,null,null,null,null,null,null,null,null,null,null,null,"VÆGFELT:",4,null,null,null,null,1000000,1000000,1000000,1000000,1000000,1000000,{"$f":"AY56","v":6500},{"$f":"AZ56","v":0},1000000,1000000,1000000,1000000,1000000,1000000,1000000,1000000,null,null,null,null,null,null,null,null,null,null,null,null,null,null,null,null,null,null,null,null,null,null,null,null,null,null,null,null,null,null,"A, ",{"$f":"IF(CI20=0,0,CA20+CC20/CI20)*1000","v":7.0785498489425986},{"$f":"IF(CL65=0,0,IF(CI20=0,0,CB20*CA20+CD20*CC20/CI20)/CL65)*1000000","v":44.999999999999993},{"$f":"IF($CJ$60-2*CM65<=0,0,1/(1+12*($CJ$54/($CJ$55*PI()^2)*($CJ$57/($CJ$60-2*CM65))^2)))","v":0.32179156676997123},{"$f":"CN65*($CJ$60-2*CM65)*$R$8","v":124.56447745934373},{"$f":"IF(CJ20=0,0,CA20)*1000","v":3},{"$f":"IF(CP65=0,0,IF(CJ20=0,0,CB20*CA20)/CP65)*1000000","v":45},{"$f":"IF($CJ$60-2*CQ65<=0,0,1/(1+12*($CJ$54/($CJ$55*PI()^2)*($CJ$57/($CJ$60-2*CQ65))^2)))","v":0.32179156676997112},{"$f":"CR65*($CJ$60-2*CQ65)*$R$8","v":124.56447745934366},{"$f":"IF(CK20=0,0,CA20+CE20/CK20)*1000","v":5.7190332326283988},{"$f":"IF(CT65=0,0,IF(CK20=0,0,CB20*CA20+CF20*CE20/CK20)/CT65)*1000000","v":44.999999999999993},{"$f":"IF($CJ$60-2*CU65<=0,0,1/(1+12*($CJ$54/($CJ$55*PI()^2)*($CJ$57/($CJ$60-2*CU65))^2)))","v":0.32179156676997123},{"$f":"CV65*($CJ$60-2*CU65)*$R$8","v":124.56447745934373},{"$f":"IF(OR(CL65>CO65,CP65>CS65,CT65>CW65),1,0)","v":0},{"$f":"IF(CX65=0,\"\",CK65)","v":""}]
[null,null,null,null,null,null,null,null,null,null,null,null,null,null,null,null,null,null,null,null,null,null,null,null,null,null,null,null,null,null,null,null,null,null,null,null,null,null,null,null,null,null,1000000,1000000,1000000,1000000,1000000,1000000,7000,0,1000000,1000000,1000000,1000000,1000000,1000000,1000000,1000000,null,null,null,null,null,null,null,null,null,null,null,null,null,null,null,null,null,null,null,null,null,null,null,null,null,null,null,null,null,null,"B, ",{"$f":"IF(CI21=0,0,CA21+CC21/CI21)*1000","v":9.4380664652567976},{"$f":"IF(CL66=0,0,IF(CI21=0,0,CB21*CA21+CD21*CC21/CI21)/CL66)*1000000","v":44.999999999999993},{"$f":"IF($CJ$60-2*CM66<=0,0,1/(1+12*($CJ$54/($CJ$55*PI()^2)*($CJ$57/($CJ$60-2*CM66))^2)))","v":0.32179156676997123},{"$f":"CN66*($CJ$60-2*CM66)*$R$8","v":124.56447745934373},{"$f":"IF(CJ21=0,0,CA21)*1000","v":4},{"$f":"IF(CP66=0,0,IF(CJ21=0,0,CB21*CA21)/CP66)*1000000","v":44.999999999999993},{"$f":"IF($CJ$60-2*CQ66<=0,0,1/(1+12*($CJ$54/($CJ$55*PI()^2)*($CJ$57/($CJ$60-2*CQ66))^2)))","v":0.32179156676997123},{"$f":"CR66*($CJ$60-2*CQ66)*$R$8","v":124.56447745934373},{"$f":"IF(CK21=0,0,CA21+CE21/CK21)*1000","v":7.6253776435045317},{"$f":"IF(CT66=0,0,IF(CK21=0,0,CB21*CA21+CF21*CE21/CK21)/CT66)*1000000","v":44.999999999999986},{"$f":"IF($CJ$60-2*CU66<=0,0,1/(1+12*($CJ$54/($CJ$55*PI()^2)*($CJ$57/($CJ$60-2*CU66))^2)))","v":0.32179156676997128},{"$f":"CV66*($CJ$60-2*CU66)*$R$8","v":124.56447745934378},{"$f":"IF(OR(CL66>CO66,CP66>CS66,CT66>CW66),1,0)","v":0},""]
[null,null,null,null,null,null,null,null,null,null,null,null,null,null,null,null,null,null,null,null,null,null,null,null,null,null,null,null,null,null,null,null,null,null,null,null,null,null,null,null,null,null,1000000,1000000,1000000,1000000,1000000,1000000,7000,2500,1000000,1000000,1000000,1000000,1000000,1000000,1000000,1000000,null,null,null,null,null,null,null,null,null,null,null,null,null,null,null,null,null,null,null,null,null,null,null,null,null,null,null,null,null,null,"C, ",37.75226586102719,22.499999999999996,0.59234812280486482,401.2680831903923,16,22.499999999999996,0.59234812280486482,401.2680831903923,30.501510574018127,22.499999999999993,0.59234812280486493,401.26808319039236,0,""]
[null,null,null,null,null,null,null,null,null,null,null,null,null,null,null,null,null,null,null,null,null,null,null,null,null,null,null,null,null,null,null,null,null,null,null,null,null,null,null,null,null,null,1000000,1000000,1000000,1000000,1000000,1000000,6850,2500,1000000,1000000,1000000,1000000,1000000,1000000,1000000,1000000,null,null,null,null,null,null,null,null,null,null,null,null,null,null,null,null,null,null,null,null,null,null,null,null,null,null,null,null,null,null,"D, ",37.75226586102719,22.499999999999996,0.59234812280486482,401.2680831903923,16,22.499999999999996,0.59234812280486482,401.2680831903923,30.501510574018127,22.499999999999993,0.59234812280486493,401.26808319039236,0,""]
[null,null,null,null,null,null,null,null,null,null,null,null,null,null,null,null,null,null,null,null,null,null,null,null,null,null,null,null,null,null,null,null,null,null,null,null,null,null,null,null,null,null,1000000,1000000,1000000,1000000,1000000,1000000,6850,3000,1000000,1000000,1000000,1000000,1000000,1000000,1000000,1000000,null,null,null,null,null,null,null,null,null,null,null,null,null,null,null,null,null,null,null,null,null,null,null,null,null,null,null,null,null,null,"E, ",11.797583081570997,44.999999999999993,0.32179156676997123,124.56447745934373,5,44.999999999999993,0.32179156676997123,124.56447745934373,9.5317220543806638,45,0.32179156676997112,124.56447745934366,0,""]
[null,null,null,null,null,null,null,null,null,null,null,null,null,null,null,null,null,null,null,null,null,null,null,null,null,null,null,null,null,null,null,null,null,null,null,null,null,null,null,null,null,null,1000000,1000000,1000000,1000000,1000000,1000000,6635,3000,1000000,1000000,1000000,1000000,1000000,1000000,1000000,1000000,null,null,null,null,null,null,null,null,null,null,null,null,null,null,null,null,null,null,null,null,null,null,null,null,null,null,null,null,null,null,"F, ",40.111782477341386,23.82352941176471,0.57996125323187175,382.97251636563817,17,23.823529411764707,0.57996125323187175,382.97251636563817,32.407854984894264,23.823529411764703,0.57996125323187198,382.9725163656384,0,""]
[null,null,null,null,null,null,null,null,null,null,null,null,null,null,null,null,null,null,null,null,null,null,null,null,null,null,null,null,null,null,null,null,null,null,null,null,null,null,null,null,null,null,1000000,1000000,1000000,1000000,1000000,1000000,6635,2500,1000000,1000000,1000000,1000000,1000000,1000000,1000000,1000000,null,null,null,null,null,null,null,null,null,null,null,null,null,null,null,null,null,null,null,null,null,null,null,null,null,null,null,null,null,null,"G, ",40.111782477341386,23.82352941176471,0.57996125323187175,382.97251636563817,17,23.823529411764707,0.57996125323187175,382.97251636563817,32.407854984894264,23.823529411764703,0.57996125323187198,382.9725163656384,0,""]
[null,null,null,null,null,null,null,null,null,null,null,null,null,null,null,null,null,null,null,null,null,null,null,null,null,null,null,null,null,null,null,null,null,null,null,null,null,null,null,null,null,null,1000000,1000000,1000000,1000000,1000000,1000000,6500,2500,1000000,1000000,1000000,1000000,1000000,1000000,1000000,1000000,null,null,null,null,null,null,null,null,null,null,null,null,null,null,null,null,null,null,null,null,null,null,null,null,null,null,null,null,null,null,"H, ",47.190332326283986,22.499999999999996,0.59234812280486482,401.2680831903923,20,22.499999999999996,0.59234812280486482,401.2680831903923,38.126888217522655,22.5,0.59234812280486482,401.2680831903923,0,""]
[null,null,null,null,null,null,null,null,null,null,null,null,null,null,null,null,null,null,null,null,null,null,null,null,null,null,null,null,null,null,null,null,null,null,null,null,null,null,null,null,null,null,1000000,1000000,1000000,1000000,1000000,1000000,6500,0,1000000,1000000,1000000,1000000,1000000,1000000,1000000,1000000,null,null,null,null,null,null,null,null,null,null,null,null,null,null,null,null,null,null,null,null,null,null,null,null,null,null,null,null,null,null,"I, ",47.190332326283986,22.499999999999996,0.59234812280486482,401.2680831903923,20,22.499999999999996,0.59234812280486482,401.2680831903923,38.126888217522655,22.5,0.59234812280486482,401.2680831903923,0,""]
[null,null,null,null,null,null,null,null,null,null,null,null,null,null,null,null,null,null,null,null,null,null,null,null,null,null,null,null,null,null,null,null,null,null,null,null,null,null,null,null,null,null,null,null,null,null,null,null,null,null,null,null,null,null,null,null,null,null,null,null,null,null,null,null,null,null,null,null,null,null,null,null,null,null,null,null,null,null,null,null,null,null,null,null,null,null,null,null,"FELT #3: ",null,null,null,null,null,null,null,null,null,null,null,null,{"$f":"MAX(CX75:CX83)","v":0},{"$f":"IF(MAX(CX75:CX83)=0,\"\",CK74&\"Last \"&CY75&CY76&CY77&CY78&CY79&CY80&CY81&CY82&CY83)","v":""}]
[null,null,null,null,null,null,null,null,null,null,null,null,null,null,null,null,null,null,null,null,null,null,null,null,null,null,null,null,null,null,null,null,null,null,null,null,null,null,null,null,null,null,null,null,null,null,null,null,null,null,null,null,null,null,null,null,null,null,null,null,null,null,null,null,null,null,null,null,null,null,null,null,null,null,null,null,null,null,null,null,null,null,null,null,null,null,null,null,"A, ",{"$f":"IF(CI30=0,0,CA30+CC30/CI30)*1000","v":9.6000000000000014},{"$f":"IF(CL75=0,0,IF(CI30=0,0,CB30*CA30+CD30*CC30/CI30)/CL75)*1000000","v":44.999999999999986},{"$f":"IF($CJ$60-2*CM75<=0,0,1/(1+12*($CJ$54/($CJ$55*PI()^2)*($CJ$58/($CJ$60-2*CM75))^2)))","v":0.32179156676997128},{"$f":"CN75*($CJ$60-2*CM75)*$R$8","v":124.56447745934378},{"$f":"IF(CJ30=0,0,CA30)*1000","v":0},{"$f":"IF(CP75=0,0,IF(CJ30=0,0,CB30*CA30)/CP75)*1000000","v":0},{"$f":"IF($CJ$60-2*CQ75<=0,0,1/(1+12*($CJ$54/($CJ$55*PI()^2)*($CJ$58/($CJ$60-2*CQ75))^2)))","v":0.74782219477380618},{"$f":"CR75*($CJ$60-2*CQ75)*$R$8","v":723.69889816819943},{"$f":"IF(CK30=0,0,CA30+CE30/CK30)*1000","v":9.6},{"$f":"IF(CT75=0,0,IF(CK30=0,0,CB30*CA30+CF30*CE30/CK30)/CT75)*1000000","v":45},{"$f":"IF($CJ$60-2*CU75<=0,0,1/(1+12*($CJ$54/($CJ$55*PI()^2)*($CJ$58/($CJ$60-2*CU75))^2)))","v":0.32179156676997112},{"$f":"CV75*($CJ$60-2*CU75)*$R$8","v":124.56447745934366},{"$f":"IF(OR(CL75>CO75,CP75>CS75,CT75>CW75),1,0)","v":0},{"$f":"IF(CX75=0,\"\",CK75)","v":""}]
[null,null,null,null,null,null,null,null,null,null,null,null,null,null,null,null,null,null,null,null,null,null,null,null,null,null,null,null,null,null,null,null,null,null,null,null,"B =",1,null,null,null,"Vægoverligger",null,"Bjælke A",{"$f":"Makro!C1","v":1},null,null,null,null,null,null,null,null,null,null,null,null,null,null,"Interne overliggere ",null,null,null,null,null,"Afskalningsbrud",null,null,null,"Vederlagstryk",null,null,null,null,null,null,null,null,null,null,null,null,null,null,null,null,null,null,"B, ",{"$f":"IF(CI31=0,0,CA31+CC31/CI31)*1000","v":12.799999999999999},{"$f":"IF(CL76=0,0,IF(CI31=0,0,CB31*CA31+CD31*CC31/CI31)/CL76)*1000000","v":44.999999999999993},{"$f":"IF($CJ$60-2*CM76<=0,0,1/(1+12*($CJ$54/($CJ$55*PI()^2)*($CJ$58/($CJ$60-2*CM76))^2)))","v":0.32179156676997123},{"$f":"CN76*($CJ$60-2*CM76)*$R$8","v":124.56447745934373},{"$f":"IF(CJ31=0,0,CA31)*1000","v":0},{"$f":"IF(CP76=0,0,IF(CJ31=0,0,CB31*CA31)/CP76)*1000000","v":0},{"$f":"IF($CJ$60-2*CQ76<=0,0,1/(1+12*($CJ$54/($CJ$55*PI()^2)*($CJ$58/($CJ$60-2*CQ76))^2)))","v":0.74782219477380618},{"$f":"CR76*($CJ$60-2*CQ76)*$R$8","v":723.69889816819943},{"$f":"IF(CK31=0,0,CA31+CE31/CK31)*1000","v":12.799999999999999},{"$f":"IF(CT76=0,0,IF(CK31=0,0,CB31*CA31+CF31*CE31/CK31)/CT76)*1000000","v":44.999999999999993},{"$f":"IF($CJ$60-2*CU76<=0,0,1/(1+12*($CJ$54/($CJ$55*PI()^2)*($CJ$58/($CJ$60-2*CU76))^2)))","v":0.32179156676997123},{"$f":"CV76*($CJ$60-2*CU76)*$R$8","v":124.56447745934373},{"$f":"IF(OR(CL76>CO76,CP76>CS76,CT76>CW76),1,0)","v":0},""]
[null,null,null,null,null,null,null,null,null,null,null,null,null,null,null,null,null,null,null,null,null,null,null,null,null,null,null,null,null,null,null,null,null,null,null,null,"N1   (kN)","N0   (kN)","N2    (kN)",null,null,"Separat bjælke",null,"Bjælke B",{"$f":"Makro!C2","v":1},null,null,null,null,null,null,null,null,null,null,null,null,null,null,"  Vægtykkelse, t [mm]",null,{"$f":"M19","v":150},"Væg 1-2","Væg 2-3","Væg 3-4",null,null,null,null,null,null,null,null,null,null,null,null,null,null,null,null,null,null,null,null,null,null,null,"C, ",51.199999999999996,22.499999999999996,0.59234812280486482,401.2680831903923,0,0,0.74782219477380618,723.69889816819943,51.199999999999996,22.499999999999996,0.59234812280486482,401.2680831903923,0,""]
[null,null,null,null,null,null,null,null,null,null,null,null,null,null,null,null,null,null,null,null,null,null,null,null,null,null,null,null,null,null,null,null,null,null,null,null,{"$f":"AL76*S25","v":0},{"$f":"AL76*R25","v":0},{"$f":"AL76*Q25","v":3},null,null,null,null,null,null,null,null,null,null,null,null,null,null,null,null,null,null,null,null,"  Vederlagsdybder [mm]",null,{"$f":"M21","v":135},null,null,null,null,null,null,null,null,null,null,null,null,null,null,null,null,null,null,null,null,null,null,null,null,null,null,"D, ",51.199999999999996,22.499999999999996,0.59234812280486482,401.2680831903923,0,0,0.74782219477380618,723.69889816819943,51.199999999999996,22.499999999999996,0.59234812280486482,401.2680831903923,0,""]
[null,null,null,null,null,null,null,null,null,null,null,null,null,null,null,null,null,null,null,null,null,null,null,null,null,null,null,null,null,null,null,null,null,null,null,null,{"$f":"AL76*P25","v":0},{"$f":"AL76*R25","v":0},{"$f":"AL76*Q25","v":3},null,null,null,null,"LA (m)",null,"LA (m)",null,null,null,null,null,"LB (m)",null,"LB (m)",null,null,null,null,null,null,null,null,"L (m)","L (m)","L (m)",null,null,null,null,null,null,null,null,null,null,null,null,null,null,null,null,null,null,null,null,null,null,null,"E, ",16,44.999999999999993,0.32179156676997123,124.56447745934373,0,0,0.74782219477380618,723.69889816819943,16,44.999999999999993,0.32179156676997123,124.56447745934373,0,""]
[null,null,null,null,null,null,null,null,null,null,null,null,null,null,null,null,null,null,null,null,null,null,null,null,null,null,null,null,null,null,null,null,null,null,null,null,{"$f":"AL76*P25","v":0},{"$f":"AL76*(O25+MAX(AN47,AO47))","v":12},{"$f":"AL76*Q25","v":3},null,null,null,null,1.6,null,{"$f":"$Q$27/2","v":0.8},null,null,null,null,null,1.2,null,{"$f":"$R$27/2","v":0.6},null,null,null,null,null,"ftld",{"$f":"R9","v":1.085498843133534},"MPa",{"$f":"(Q16+2*M21)/1000","v":1.77},{"$f":"(Q17+2*M21)/1000","v":0.27},{"$f":"(Q18+2*M21)/1000","v":1.27},null,null,null,null,null,null,null,null,null,null,null,null,null,null,null,null,null,null,null,null,null,null,null,"F, ",54.400000000000006,23.823529411764703,0.57996125323187198,382.9725163656384,0,0,0.74782219477380618,723.69889816819943,54.4,23.823529411764707,0.57996125323187175,382.97251636563817,0,""]
[null,null,null,null,null,null,null,null,null,null,null,null,null,null,null,null,null,null,null,null,null,null,null,null,null,null,null,null,null,null,null,null,null,null,null,null,{"$f":"AL76*P25","v":0},{"$f":"AL76*(O25+MAX(AN47,AO47))","v":12},{"$f":"AL76*N25","v":4},null,null,"Bjælkereaktioner",null,"Bjælkereaktioner",null,null,null,null,null,null,null,null,null,null,null,null,null,null,null,"fcd",{"$f":"R8","v":6.4516129032258061},"MPa",null,null,null,null,null,null,null,null,null,null,null,null,null,null,null,null,null,null,null,null,null,null,null,null,null,null,"G, ",54.400000000000006,23.823529411764703,0.57996125323187198,382.9725163656384,0,0,0.74782219477380618,723.69889816819943,54.4,23.823529411764707,0.57996125323187175,382.97251636563817,0,""]
[null,null,null,null,null,null,null,null,null,null,null,null,null,null,null,null,null,null,null,null,null,null,null,null,null,null,null,null,null,null,null,null,null,null,null,null,{"$f":"AL76*M25","v":0},{"$f":"AL76*R25","v":0},{"$f":"AL76*Q25","v":3},null,null,"NA",null,"NA",null,"NA","exc","NA-o",null,"NB",null,"NB",null,"NB","exc","NB-o",null,null,null,"NB","exc","beff","NB","NB","NB","bæreevne ",null,null,null,"bæreevne ",null,null,null,null,null,null,null,null,null,null,null,null,null,null,null,null,null,null,"H, ",64,22.499999999999996,0.59234812280486482,401.2680831903923,0,0,0.74782219477380618,723.69889816819943,64,22.499999999999996,0.59234812280486482,401.2680831903923,0,""]
[null,null,null,null,null,null,null,null,null,null,null,null,null,null,null,null,null,null,null,null,null,null,null,null,null,null,null,null,null,null,null,null,null,null,null,null,{"$f":"AL76*M25","v":0},{"$f":"AL76*(O25+MAX(AN47,AO47))","v":12},{"$f":"AL76*Q25","v":3},null,null,"(kN)  ",null,"(kN)  ",null,"(kN)  ","(mm)",null,null,"(kN)  ",null,"(kN)  ",null,"(kN)  ","(mm)",null,null,null,null,"(kN/m)  ","(mm)","(mm)","kN","kN","kN","kN",null,null,null,"kN",null,null,null,null,null,null,null,null,null,null,null,null,null,null,null,null,null,null,"I, ",64,22.499999999999996,0.59234812280486482,401.2680831903923,0,0,0.74782219477380618,723.69889816819943,64,22.499999999999996,0.59234812280486482,401.2680831903923,0,""]
[null,null,null,null,null,null,null,null,null,null,null,null,null,null,null,null,null,null,null,null,null,null,null,null,null,null,null,null,null,null,null,null,null,null,null,null,{"$f":"AL76*M25","v":0},{"$f":"AL76*(O25+MAX(AN47,AO47))","v":12},{"$f":"AL76*K25","v":5},null,null,12,null,{"$f":"BW137","v":0},null,{"$f":"IF($AP$13,IF($AS$76=1,($N31+$O31+$P31)*AT$80,$Q31),0)","v":2.4000000000000004},{"$f":"IF($AS$76=1,IF($AP$13,IF(AT84=0,0,($N$41*$N31+$O$41*$O31-$P$41*$P31)/($AT84/$AT$80)),0),$Q$41)","v":44.999999999999993},{"$f":"IF($AP$13,($N31+$O31+$P31)*AT$80,0)","v":2.4000000000000004},null,15,null,{"$f":"CL137","v":0},null,{"$f":"IF($AP$17,IF($AS$77=1,($N31+$O31+$P31)*BB$80,$R31))","v":1.7999999999999998},{"$f":"IF($AS$77=1,IF($AP$17,($N$41*$N31+$O$41*$O31-$P$41*$P31)/(BB84/$BB$80),0),$R$41)","v":45},{"$f":"IF($AP$17,($N31+$O31+$P31)*BB$80,0)","v":1.7999999999999998},null,null,null,{"$f":"N31+O31+P31","v":3},{"$f":"(N31*$N$40+O31*$O$40+P31*$P$40)/BH84","v":60},{"$f":"$BJ$77-2*BI84","v":30},{"$f":"$BH84*BK$80*0.5","v":2.6550000000000002},{"$f":"$BH84*BL$80*0.5","v":0.40500000000000003},{"$f":"$BH84*BM$80*0.5","v":1.905},{"$f":"5/4*$BJ$78*BJ84*$BI$80*10^-3","v":5.4953378933635157},{"$f":"IF(BK84>$BN84,\"Brud\",\"OK\")","v":"OK"},{"$f":"IF(BL84>$BN84,\"Brud\",\"OK\")","v":"OK"},"OK",{"$f":"0.8*BJ84*$BJ$78*$BI$81*10^-3","v":20.903225806451612},{"$f":"IF(BK84>$BR84,\"Brud\",\"OK\")","v":"OK"},{"$f":"IF(BL84>$BR84,\"Brud\",\"OK\")","v":"OK"},"OK",null,null,null,null,null,null,null,null,null,null,null,null,null,null,null,"FELT #4: ",null,null,null,null,null,null,null,null,null,null,null,null,{"$f":"MAX(CX85:CX93)","v":0},{"$f":"IF(MAX(CX85:CX93)=0,\"\",CK84&\"Last \"&CY85&CY86&CY87&CY88&CY89&CY90&CY91&CY92&CY93)","v":""}]
[null,null,null,null,null,null,null,null,null,null,null,null,null,null,null,null,null,null,null,null,null,null,null,null,null,null,null,null,null,null,null,null,null,null,null,null,{"$f":"AL76*M25","v":0},{"$f":"AL76*(L25+MAX(AM47,AP47))","v":15},{"$f":"AL76*Q25","v":3},null,null,13,null,{"$f":"BW138","v":0},null,{"$f":"IF($AP$13,IF($AS$76=1,($N32+$O32+$P32)*AT$80,$Q32),0)","v":3.2},{"$f":"IF($AS$76=1,IF($AP$13,IF(AT85=0,0,($N$41*$N32+$O$41*$O32-$P$41*$P32)/($AT85/$AT$80)),0),$Q$41)","v":45},{"$f":"IF($AP$13,($N32+$O32+$P32)*AT$80,0)","v":3.2},null,16,null,{"$f":"CL138","v":0},null,{"$f":"IF($AP$17,IF($AS$77=1,($N32+$O32+$P32)*BB$80,$R32))","v":2.4},{"$f":"IF($AS$77=1,IF($AP$17,($N$41*$N32+$O$41*$O32-$P$41*$P32)/(BB85/$BB$80),0),$R$41)","v":45},{"$f":"IF($AP$17,($N32+$O32+$P32)*BB$80,0)","v":2.4},null,null,null,{"$f":"N32+O32+P32","v":4},{"$f":"(N32*$N$40+O32*$O$40+P32*$P$40)/BH85","v":60},{"$f":"$BJ$77-2*BI85","v":30},{"$f":"$BH85*BK$80*0.5","v":3.54},0.54,2.54,{"$f":"5/4*$BJ$78*BJ85*$BI$80*10^-3","v":5.4953378933635157},{"$f":"IF(BK85>$BN85,\"Brud\",\"OK\")","v":"OK"},"OK","OK",{"$f":"0.8*BJ85*$BJ$78*$BI$81*10^-3","v":20.903225806451612},{"$f":"IF(BK85>$BR85,\"Brud\",\"OK\")","v":"OK"},"OK","OK",null,null,null,null,null,null,null,null,null,null,null,null,null,null,null,"A, ",{"$f":"IF(CI40=0,0,CA40+CC40/CI40)*1000","v":0},{"$f":"IF(CL85=0,0,IF(CI40=0,0,CB40*CA40+CD40*CC40/CI40)/CL85)*1000000","v":0},{"$f":"IF($CJ$60-2*CM85<=0,0,1/(1+12*($CJ$54/($CJ$55*PI()^2)*($CJ$59/($CJ$60-2*CM85))^2)))","v":0.74782219477380618},{"$f":"CN85*($CJ$60-2*CM85)*$R$8","v":723.69889816819943},{"$f":"IF(CJ40=0,0,CA40)*1000","v":0},{"$f":"IF(CP85=0,0,IF(CJ40=0,0,CB40*CA40)/CP85)*1000000","v":0},{"$f":"IF($CJ$60-2*CQ85<=0,0,1/(1+12*($CJ$54/($CJ$55*PI()^2)*($CJ$59/($CJ$60-2*CQ85))^2)))","v":0.74782219477380618},{"$f":"CR85*($CJ$60-2*CQ85)*$R$8","v":723.69889816819943},{"$f":"IF(CK40=0,0,CA40+CE40/CK40)*1000","v":0},{"$f":"IF(CT85=0,0,IF(CK40=0,0,CB40*CA40+CF40*CE40/CK40)/CT85)*1000000","v":0},{"$f":"IF($CJ$60-2*CU85<=0,0,1/(1+12*($CJ$54/($CJ$55*PI()^2)*($CJ$59/($CJ$60-2*CU85))^2)))","v":0.74782219477380618},{"$f":"CV85*($CJ$60-2*CU85)*$R$8","v":723.69889816819943},{"$f":"IF(OR(CL85>CO85,CP85>CS85,CT85>CW85),1,0)","v":0},{"$f":"IF(CX85=0,\"\",CK85)","v":""}]
[null,null,null,null,null,null,null,null,null,null,null,null,null,null,null,null,null,null,null,null,null,null,null,null,null,null,null,null,null,null,null,null,null,null,null,null,{"$f":"AL76*M25","v":0},{"$f":"AL76*(L25+MAX(AM47,AP47))","v":15},{"$f":"AL76*K25","v":5},null,null,13,null,0,null,12.8,22.5,12.8,null,16,null,0,null,9.6,22.5,9.6,null,null,null,16,26.25,97.5,14.16,2.16,10.16,17.859848153431429,"OK","OK","OK",67.935483870967744,"OK","OK","OK",null,null,null,null,null,null,null,null,null,null,null,null,null,null,null,"B, ",{"$f":"IF(CI41=0,0,CA41+CC41/CI41)*1000","v":0},{"$f":"IF(CL86=0,0,IF(CI41=0,0,CB41*CA41+CD41*CC41/CI41)/CL86)*1000000","v":0},{"$f":"IF($CJ$60-2*CM86<=0,0,1/(1+12*($CJ$54/($CJ$55*PI()^2)*($CJ$59/($CJ$60-2*CM86))^2)))","v":0.74782219477380618},{"$f":"CN86*($CJ$60-2*CM86)*$R$8","v":723.69889816819943},{"$f":"IF(CJ41=0,0,CA41)*1000","v":0},{"$f":"IF(CP86=0,0,IF(CJ41=0,0,CB41*CA41)/CP86)*1000000","v":0},{"$f":"IF($CJ$60-2*CQ86<=0,0,1/(1+12*($CJ$54/($CJ$55*PI()^2)*($CJ$59/($CJ$60-2*CQ86))^2)))","v":0.74782219477380618},{"$f":"CR86*($CJ$60-2*CQ86)*$R$8","v":723.69889816819943},{"$f":"IF(CK41=0,0,CA41+CE41/CK41)*1000","v":0},{"$f":"IF(CT86=0,0,IF(CK41=0,0,CB41*CA41+CF41*CE41/CK41)/CT86)*1000000","v":0},{"$f":"IF($CJ$60-2*CU86<=0,0,1/(1+12*($CJ$54/($CJ$55*PI()^2)*($CJ$59/($CJ$60-2*CU86))^2)))","v":0.74782219477380618},{"$f":"CV86*($CJ$60-2*CU86)*$R$8","v":723.69889816819943},0,""]
[null,null,null,null,null,null,null,null,null,null,null,null,null,null,null,null,null,null,null,null,null,null,null,null,null,null,null,null,null,null,null,null,null,null,null,null,{"$f":"AL76*Q25","v":3},{"$f":"AL76*R25","v":0},{"$f":"AL76*S25","v":0},null,null,13,null,0,null,12.8,22.5,12.8,null,16,null,0,null,9.6,22.5,9.6,null,null,null,16,26.25,97.5,14.16,2.16,10.16,17.859848153431429,"OK","OK","OK",67.935483870967744,"OK","OK","OK",null,null,null,null,null,null,null,null,null,null,null,null,null,null,null,"C, ",0,0,0.74782219477380618,723.69889816819943,0,0,0.74782219477380618,723.69889816819943,0,0,0.74782219477380618,723.69889816819943,0,""]
[null,null,null,null,null,null,null,null,null,null,null,null,null,null,null,null,null,null,null,null,null,null,null,null,null,null,null,null,null,null,null,null,null,null,null,null,{"$f":"AL76*N25","v":4},{"$f":"AL76*R25","v":0},{"$f":"AL76*S25","v":0},null,null,13,null,0,null,4,45,4,null,16,null,0,null,3,45,3,null,null,null,5,60,30,4.4249999999999998,0.67500000000000004,3.1749999999999998,5.4953378933635157,"OK","OK","OK",20.903225806451612,"OK","OK","OK",null,null,null,null,null,null,null,null,null,null,null,null,null,null,null,"D, ",0,0,0.74782219477380618,723.69889816819943,0,0,0.74782219477380618,723.69889816819943,0,0,0.74782219477380618,723.69889816819943,0,""]
[null,null,null,null,null,null,null,null,null,null,null,null,null,null,null,null,null,null,null,null,null,null,null,null,null,null,null,null,null,null,null,null,null,null,null,null,{"$f":"AL76*N25","v":4},{"$f":"AL76*(O25+MAX(AN47,AO47))","v":12},{"$f":"AL76*S25","v":0},null,null,13,null,0,null,13.600000000000001,23.823529411764707,13.600000000000001,null,16,null,0,null,10.199999999999999,23.823529411764707,10.199999999999999,null,null,null,17,28.235294117647058,93.529411764705884,15.045,2.2949999999999999,10.795,17.132524020486255,"OK","OK","OK",65.168880455407972,"OK","OK","OK",null,null,null,null,null,null,null,null,null,null,null,null,null,null,null,"E, ",0,0,0.74782219477380618,723.69889816819943,0,0,0.74782219477380618,723.69889816819943,0,0,0.74782219477380618,723.69889816819943,0,""]
[null,null,null,null,null,null,null,null,null,null,null,null,null,null,null,null,null,null,null,null,null,null,null,null,null,null,null,null,null,null,null,null,null,null,null,null,{"$f":"AL76*N25","v":4},{"$f":"AL76*(O25+MAX(AN47,AO47))","v":12},{"$f":"AL76*P25","v":0},null,null,13,null,0,null,13.600000000000001,23.823529411764707,13.600000000000001,null,16,null,0,null,10.199999999999999,23.823529411764707,10.199999999999999,null,null,null,17,28.235294117647058,93.529411764705884,15.045,2.2949999999999999,10.795,17.132524020486255,"OK","OK","OK",65.168880455407972,"OK","OK","OK",null,null,null,null,null,null,null,null,null,null,null,null,null,null,null,"F, ",0,0,0.74782219477380618,723.69889816819943,0,0,0.74782219477380618,723.69889816819943,0,0,0.74782219477380618,723.69889816819943,0,""]
[null,null,null,null,null,null,null,null,null,null,null,null,null,null,null,null,null,null,null,null,null,null,null,null,null,null,null,null,null,null,null,null,null,null,null,null,{"$f":"AL76*K25","v":5},{"$f":"AL76*R25","v":0},{"$f":"AL76*S25","v":0},null,null,13,null,0,null,16,22.5,16,null,16,null,0,null,12,22.5,12,null,null,null,20,26.25,97.5,17.7,2.7,12.7,17.859848153431429,"OK","OK","OK",67.935483870967744,"OK","OK","OK",null,null,null,null,null,null,null,null,null,null,null,null,null,null,null,"G, ",0,0,0.74782219477380618,723.69889816819943,0,0,0.74782219477380618,723.69889816819943,0,0,0.74782219477380618,723.69889816819943,0,""]
[null,null,null,null,null,null,null,null,null,null,null,null,null,null,null,null,null,null,null,null,null,null,null,null,null,null,null,null,null,null,null,null,null,null,null,null,{"$f":"AL76*K25","v":5},{"$f":"AL76*(O25+MAX(AN47,AO47))","v":12},{"$f":"AL76*S25","v":0},null,null,13,null,0,null,16,22.5,16,null,16,null,0,null,12,22.5,12,null,null,null,20,26.25,97.5,17.7,2.7,12.7,17.859848153431429,"OK","OK","OK",67.935483870967744,"OK","OK","OK",null,null,null,null,null,null,null,null,null,null,null,null,null,null,null,"H, ",0,0,0.74782219477380618,723.69889816819943,0,0,0.74782219477380618,723.69889816819943,0,0,0.74782219477380618,723.69889816819943,0,""]
[null,null,null,null,null,null,null,null,null,null,null,null,null,null,null,null,null,null,null,null,null,null,null,null,null,null,null,null,null,null,null,null,null,null,null,null,{"$f":"AL76*K25","v":5},{"$f":"AL76*(O25+MAX(AN47,AO47))","v":12},{"$f":"AL76*M25","v":0},null,null,40,null,null,null,null,null,null,null,40,null,null,null,null,null,null,null,null,null,null,null,null,null,null,null,"Brud",{"$f":"COUNTIF(BO84:BO92,\"Brud\")","v":0},{"$f":"COUNTIF(BP84:BP92,\"Brud\")","v":0},{"$f":"COUNTIF(BQ84:BQ92,\"Brud\")","v":0},"Brud",{"$f":"COUNTIF(BS84:BS92,\"Brud\")","v":0},{"$f":"COUNTIF(BT84:BT92,\"Brud\")","v":0},{"$f":"COUNTIF(BU84:BU92,\"Brud\")","v":0},null,null,null,null,null,null,null,null,null,null,null,null,null,null,null,"I, ",0,0,0.74782219477380618,723.69889816819943,0,0,0.74782219477380618,723.69889816819943,0,0,0.74782219477380618,723.69889816819943,0,""]
[null,null,null,null,null,null,null,null,null,null,null,null,null,null,null,null,null,null,null,null,null,null,null,null,null,null,null,null,null,null,null,null,null,null,null,null,{"$f":"AL76*K25","v":5},{"$f":"AL76*(L25+MAX(AM47,AP47))","v":15},{"$f":"AL76*S25","v":0},null,null,{"$f":"2*AP93/3+$R$11","v":31.666666666666668},null,null,null,null,null,null,null,{"$f":"2*AX93/3+$R$11","v":31.666666666666668},null,null,null,null,null,null,null,null,null,null,null,null,null,null,null,"Eksist.",{"$f":"AP14","v":true},{"$f":"AP15","v":false},{"$f":"AP16","v":true},"Eksist.",{"$f":"AP14","v":true},{"$f":"AP15","v":false},{"$f":"AP16","v":true}]
[null,null,null,null,null,null,null,null,null,null,null,null,null,null,null,null,null,null,null,null,null,null,null,null,null,null,null,null,null,null,null,null,null,null,null,null,{"$f":"AL76*K25","v":5},{"$f":"AL76*(L25+MAX(AM47,AP47))","v":15},{"$f":"AL76*M25","v":0},null,null,null,null,null,null,null,null,null,null,null,null,null,null,null,null,null,null,null,null,null,null,null,null,null,null,"Besked:",{"$f":"IF(OR(AND(BO94,BO93>0),AND(BP94,BP93>0),AND(BQ94,BQ93>0)),\"(intern overligger)\",\"\")","v":""},null,null,"Besked:",{"$f":"IF(OR(AND(BS94,BS93>0),AND(BT94,BT93>0),AND(BU94,BU93>0)),\"(intern overligger)\",\"\")","v":""}]
[]
[null,null,null,null,null,null,null,null,null,null,null,null,null,null,null,null,null,null,null,null,null,null,null,null,null,null,null,null,null,null,null,null,null,null,null,null,null,null,null,null,null,null,null,null,null,null,null,null,null,null,null,null,null,null,null,null,null,null,null,"Eksterne overliggere ",null,null,null,null,null,"Afskalningsbrud",null,null,null,"Vederlagstryk"]
[null,null,null,null,null,null,null,null,null,null,null,null,null,null,null,null,null,null,null,null,null,null,null,null,null,null,null,null,null,null,null,null,null,null,null,null,"Brudlasttilfælde",null,null,null,"Trækstyrke",null,{"$f":"Makro!B1","v":1},null,{"$f":"$M$10","v":1.7367981490136544},null,"Tværvæg",null,"Tværvæg",null,"Felt 1",null,"Felt 2",null,"Felt 3",null,"Felt 4",null,null,"  Vægtykkelse, t [mm]",null,{"$f":"M19","v":150},"Bjælke A","Bjælke B",null,"Bjælke A",null,"Bjælke B",null,"Bjælke A",null,"Bjælke B"]
[null,null,null,null,null,null,null,null,null,null,null,null,null,null,null,null,null,null,null,null,null,null,null,null,null,null,null,null,null,null,null,null,null,null,null,null,null,1,null,null,"Beregn",null,{"$f":"0.42*$M$9^(2/3)*IF($M$8>1400,(0.4+0.6*$M$8/2200),0.78)","v":1.7367981490136544},null,null,null,1,null,2,null,"tv 1",{"$f":"IF(AND($AU$101>=AZ10,$AU$101<=AZ11),TRUE,FALSE)","v":false},"tv 1",{"$f":"IF(AND($AU$101>=BB10,$AU$101<=BB11),TRUE,FALSE)","v":true},"tv 1",{"$f":"IF(AND($AU$101>=BD10,$AU$101<=BD11),TRUE,FALSE)","v":false},"tv 1",{"$f":"IF(AND($AU$101>=BF10,$AU$101<=BF11),TRUE,FALSE)","v":false},null,"  Vederlagsdybder [mm]",null,{"$f":"Q15","v":150}]
[null,null,null,null,null,null,null,null,null,null,null,null,null,null,null,null,null,null,null,null,null,null,null,null,null,null,null,null,null,null,null,null,null,null,null,null,null,2,null,null,"Definer",null,1.8,null,null,null,"x","y","x","y","tv2",{"$f":"IF(AND($AW$101>=AZ10,$AW$101<=AZ11),TRUE,FALSE)","v":false},"tv2",{"$f":"IF(AND($AW$101>=BB10,$AW$101<=BB11),TRUE,FALSE)","v":false},"tv2",{"$f":"IF(AND($AW$101>=BD10,$AW$101<=BD11),TRUE,FALSE)","v":true},"tv2",{"$f":"IF(AND($AW$101>=BF10,$AW$101<=BF11),TRUE,FALSE)","v":false},null,"  Vederlagsdybder [mm]",null,{"$f":"Q19","v":150},"L (m)","L (m)"]
[null,null,null,null,null,null,null,null,null,null,null,null,null,null,null,null,null,null,null,null,null,null,null,null,null,null,null,null,null,null,null,null,null,null,null,null,null,null,null,null,null,null,null,null,null,null,{"$f":"IF(AU103,Q20,1000000)","v":3000},0,{"$f":"IF(AW103,Q21,1000000)","v":6750},0,"b-tv1",{"$f":"IF(AZ99,MAX($AU$101-AZ10,IF(AZ100,$AW$101,AZ11)-$AU$101),IF(AZ100,0,AZ11-AZ10))","v":1250},"b-tv1",{"$f":"IF(BB99,MAX($AU$101-BB10,IF(BB100,$AW$101,BB11)-$AU$101),IF(BB100,0,BB11-BB10))","v":2500},"b-tv1",{"$f":"IF(BD99,MAX($AU$101-BD10,IF(BD100,$AW$101,BD11)-$AU$101),IF(BD100,0,BD11-BD10))","v":0},"b-tv1",{"$f":"IF(BF99,MAX($AU$101-BF10,IF(BF100,$AW$101,BF11)-$AU$101),IF(BF100,0,BF11-BF10))","v":0},null,"ftld",{"$f":"R9","v":1.085498843133534},"MPa",{"$f":"Q27","v":1.6},{"$f":"R27","v":1.2}]
[null,null,null,null,null,null,null,null,null,null,null,null,null,null,null,null,null,null,null,null,null,null,null,null,null,null,null,null,null,null,null,null,null,null,null,null,null,null,null,null,null,null,null,null,null,null,{"$f":"AU101","v":3000},{"$f":"$AL$10","v":3000},{"$f":"AW101","v":6750},{"$f":"$AL$10","v":3000},"b-tv2",{"$f":"IF(AZ100,MAX($AW$101-IF(AZ99,$AU$101,AZ10),AZ11-$AW$101),IF(AZ99,0,AZ11-AZ10))","v":1250},"b-tv2",{"$f":"IF(BB100,MAX($AW$101-IF(BB99,$AU$101,BB10),BB11-$AW$101),IF(BB99,0,BB11-BB10))","v":0},"b-tv2",{"$f":"IF(BD100,MAX($AW$101-IF(BD99,$AU$101,BD10),BD11-$AW$101),IF(BD99,0,BD11-BD10))","v":250},"b-tv2",{"$f":"IF(BF100,MAX($AW$101-IF(BF99,$AU$101,BF10),BF11-$AW$101),IF(BF99,0,BF11-BF10))","v":0},null,"fcd",{"$f":"R8","v":6.4516129032258061},"MPa"]
[null,null,null,null,null,null,null,null,null,null,null,null,null,null,null,null,null,null,null,null,null,null,null,null,null,null,null,null,null,null,null,null,null,null,null,null,null,null,null,null,null,null,null,null,null,null,{"$f":"Makro!A6","v":true},null,{"$f":"Makro!A7","v":true},null,"beff",{"$f":"MAX(AZ101:AZ102,0.5*AZ110,0.01)","v":1250},"beff",{"$f":"MAX(BB101:BB102,0.5*BB110,0.01)","v":2500},"beff",{"$f":"MAX(BD101:BD102,0.5*BD110,0.01)","v":250},"beff",{"$f":"MAX(BF101:BF102,0.5*BF110,0.01)","v":0.01},null,"NB","exc","beff","NB","NB",null,"bæreevne ",null,"bæreevne ",null,"bæreevne ",null,"bæreevne "]
[null,null,null,null,null,null,null,null,null,null,null,null,null,null,null,null,null,null,null,null,null,null,null,null,null,null,null,null,null,null,null,null,null,null,null,null,null,null,null,null,null,null,null,null,null,null,null,null,null,null,"H",{"$f":"$AL$10","v":3000},"H",{"$f":"$AL$10","v":3000},"H",{"$f":"$AL$10","v":3000},"H",{"$f":"$AL$10","v":3000},null,"(kN/m)  ","(mm)","(mm)","kN","kN",null,"kN",null,"kN",null,"kN",null,"kN"]
[null,null,null,null,null,null,null,null,null,null,null,null,null,null,null,null,null,null,null,null,null,null,null,null,null,null,null,null,null,null,null,null,null,null,null,null,null,null,null,null,null,null,null,null,null,null,null,null,null,null,"Tilf.",{"$f":"IF(AZ99<>AZ100,1,IF(AND(AZ99,AZ100),2,0))","v":0},"Tilf.",{"$f":"IF(BB99<>BB100,1,IF(AND(BB99,BB100),2,0))","v":1},"Tilf.",{"$f":"IF(BD99<>BD100,1,IF(AND(BD99,BD100),2,0))","v":1},"Tilf.",{"$f":"IF(BF99<>BF100,1,IF(AND(BF99,BF100),2,0))","v":0},null,{"$f":"N31+O31+P31","v":3},{"$f":"(N31*$N$40+O31*$O$40+P31*$P$40)/BH84","v":60},{"$f":"$BJ$98-2*BI105","v":30},{"$f":"IF(BK$101=0,Q31,$BH105*BK$101*0.5)","v":2.4000000000000004},{"$f":"IF(BL$101=0,R31,$BH105*BL$101*0.5)","v":1.7999999999999998},null,{"$f":"5/4*$BJ$99*BJ105*$BI$101*10^-3","v":6.1059309926261287},{"$f":"IF(BK105>$BN105,\"Brud\",\"OK\")","v":"OK"},{"$f":"5/4*$BJ$100*BJ105*$BI$101*10^-3","v":6.1059309926261287},{"$f":"IF(BL105>$BP105,\"Brud\",\"OK\")","v":"OK"},{"$f":"0.8*BJ105*$BJ$99*$BI$102*10^-3","v":23.2258064516129},{"$f":"IF(BK105>$BR105,\"Brud\",\"OK\")","v":"OK"},{"$f":"0.8*BJ105*$BJ$100*$BI$102*10^-3","v":23.2258064516129},{"$f":"IF(BM105>$BR105,\"Brud\",\"OK\")","v":"OK"}]
[null,null,null,null,null,null,null,null,null,null,null,null,null,null,null,null,null,null,null,null,null,null,null,null,null,null,null,null,null,null,null,null,null,null,null,null,null,null,null,null,null,null,null,null,null,null,"x =",3000,null,null,null,{"$f":"IF(AZ105=0,1,IF(AZ105=1,1/(1+(AZ104/(3*AZ103))^2),IF(AZ103>=AZ104,1/(1+(AZ104/AZ103)^2),AZ103/(2*AZ104))))","v":1},null,{"$f":"IF(BB105=0,1,IF(BB105=1,1/(1+(BB104/(3*BB103))^2),IF(BB103>=BB104,1/(1+(BB104/BB103)^2),BB103/(2*BB104))))","v":0.86206896551724133},null,{"$f":"IF(BD105=0,1,IF(BD105=1,1/(1+(BD104/(3*BD103))^2),IF(BD103>=BD104,1/(1+(BD104/BD103)^2),BD103/(2*BD104))))","v":5.8823529411764705E-2},null,{"$f":"IF(BF105=0,1,IF(BF105=1,1/(1+(BF104/(3*BF103))^2),IF(BF103>=BF104,1/(1+(BF104/BF103)^2),BF103/(2*BF104))))","v":1},null,{"$f":"N32+O32+P32","v":4},{"$f":"(N32*$N$40+O32*$O$40+P32*$P$40)/BH85","v":60},{"$f":"$BJ$98-2*BI106","v":30},{"$f":"IF(BK$101=0,Q32,$BH106*BK$101*0.5)","v":3.2},2.4,null,{"$f":"5/4*$BJ$99*BJ106*$BI$101*10^-3","v":6.1059309926261287},{"$f":"IF(BK106>$BN106,\"Brud\",\"OK\")","v":"OK"},{"$f":"5/4*$BJ$100*BJ106*$BI$101*10^-3","v":6.1059309926261287},{"$f":"IF(BL106>$BP106,\"Brud\",\"OK\")","v":"OK"},23.2258064516129,{"$f":"IF(BK106>$BR106,\"Brud\",\"OK\")","v":"OK"},{"$f":"0.8*BJ106*$BJ$100*$BI$102*10^-3","v":23.2258064516129},"OK"]
[null,null,null,null,null,null,null,null,null,null,null,null,null,null,null,null,null,null,null,null,null,null,null,null,null,null,null,null,null,null,null,null,null,null,null,null,null,null,null,null,null,null,null,null,null,null,"x =",6750,null,null,"Ls",{"$f":"AZ106*AZ104","v":3000},null,{"$f":"BB106*BB104","v":2586.2068965517242},null,{"$f":"BD106*BD104","v":176.47058823529412},null,{"$f":"BF106*BF104","v":3000},null,16,26.25,97.5,12.8,9.6,null,19.844275726034919,"OK",19.844275726034919,"OK",75.483870967741922,"OK",75.483870967741922,"OK"]
[null,null,null,null,null,null,null,null,null,null,null,null,null,null,null,null,null,null,null,null,null,null,null,null,null,null,null,null,null,null,null,null,null,null,null,null,null,null,null,null,null,null,null,null,null,null,null,null,null,null,"B",{"$f":"AZ11-AZ10","v":1250},null,{"$f":"BB11-BB10","v":2750},null,{"$f":"BD11-BD10","v":500},null,{"$f":"BF11-BF10","v":0},null,16,26.25,97.5,12.8,9.6,null,19.844275726034919,"OK",19.844275726034919,"OK",75.483870967741922,"OK",75.483870967741922,"OK"]
[null,null,null,null,null,null,null,null,null,null,null,null,null,null,null,null,null,null,null,null,null,null,null,null,null,null,null,null,null,null,null,null,null,null,null,null,null,null,null,null,null,null,null,null,null,null,null,null,null,null,"b_v",{"$f":"MAX(IF(AZ99,MIN($AU$101,IF(AZ100,$AW$101,1000000))-AZ10,0),IF(AZ100,MIN(IF(AZ99,$AU$101,1000000),$AW$101)-AZ10,0),IF(OR(AZ99,AZ100),0,AZ108))","v":1250},null,{"$f":"MAX(IF(BB99,MIN($AU$101,IF(BB100,$AW$101,1000000))-BB10,0),IF(BB100,MIN(IF(BB99,$AU$101,1000000),$AW$101)-BB10,0),IF(OR(BB99,BB100),0,BB108))","v":250},null,{"$f":"MAX(IF(BD99,MIN($AU$101,IF(BD100,$AW$101,1000000))-BD10,0),IF(BD100,MIN(IF(BD99,$AU$101,1000000),$AW$101)-BD10,0),IF(OR(BD99,BD100),0,BD108))","v":250},null,{"$f":"MAX(IF(BF99,MIN($AU$101,IF(BF100,$AW$101,1000000))-BF10,0),IF(BF100,MIN(IF(BF99,$AU$101,1000000),$AW$101)-BF10,0),IF(OR(BF99,BF100),0,BF108))","v":0},null,5,60,30,4,3,null,6.1059309926261287,"OK",6.1059309926261287,"OK",23.2258064516129,"OK",23.2258064516129,"OK"]
[null,null,null,null,null,null,null,null,null,null,null,null,null,null,null,null,null,null,null,null,null,null,null,null,null,null,null,null,null,null,null,null,null,null,null,null,null,null,null,null,null,null,null,null,null,null,null,null,null,null,"b_m",{"$f":"IF(AZ109+AZ111<AZ108,AZ108-AZ109-AZ111,AZ108)","v":1250},null,{"$f":"IF(BB109+BB111<BB108,BB108-BB109-BB111,BB108)","v":2750},null,{"$f":"IF(BD109+BD111<BD108,BD108-BD109-BD111,BD108)","v":500},null,{"$f":"IF(BF109+BF111<BF108,BF108-BF109-BF111,BF108)","v":0},null,17,28.235294117647058,93.529411764705884,13.600000000000001,10.199999999999999,null,19.036137800540285,"OK",19.036137800540285,"OK",72.409867172675519,"OK",72.409867172675519,"OK"]
[null,null,null,null,null,null,null,null,null,null,null,null,null,null,null,null,null,null,null,null,null,null,null,null,null,null,null,null,null,null,null,null,null,null,null,null,null,null,null,null,null,null,null,null,null,null,null,null,null,null,"b_h",{"$f":"MAX(IF(AZ99,AZ11-MAX($AU$101,IF(AZ100,$AW$101,0)),0),IF(AZ100,AZ11-MAX(IF(AZ99,$AU$101,0),$AW$101),0),IF(OR(AZ99,AZ100),0,AZ108))","v":1250},null,{"$f":"MAX(IF(BB99,BB11-MAX($AU$101,IF(BB100,$AW$101,0)),0),IF(BB100,BB11-MAX(IF(BB99,$AU$101,0),$AW$101),0),IF(OR(BB99,BB100),0,BB108))","v":2500},null,{"$f":"MAX(IF(BD99,BD11-MAX($AU$101,IF(BD100,$AW$101,0)),0),IF(BD100,BD11-MAX(IF(BD99,$AU$101,0),$AW$101),0),IF(OR(BD99,BD100),0,BD108))","v":250},null,{"$f":"MAX(IF(BF99,BF11-MAX($AU$101,IF(BF100,$AW$101,0)),0),IF(BF100,BF11-MAX(IF(BF99,$AU$101,0),$AW$101),0),IF(OR(BF99,BF100),0,BF108))","v":0},null,17,28.235294117647058,93.529411764705884,13.600000000000001,10.199999999999999,null,19.036137800540285,"OK",19.036137800540285,"OK",72.409867172675519,"OK",72.409867172675519,"OK"]
[null,null,null,null,null,null,null,null,null,null,null,null,null,null,null,null,null,null,null,null,null,null,null,null,null,null,null,null,null,null,null,null,null,null,null,null,null,null,null,null,null,null,null,null,null,null,null,null,null,null,"ks",{"$f":"1/(1+12*($M$9/($M$11*PI()^2))*(AZ107/($M$19-2*$R$11))^2)","v":0.72092309620248363},null,{"$f":"1/(1+12*($M$9/($M$11*PI()^2))*(BB107/($M$19-2*$R$11))^2)","v":0.77658673861543159},null,{"$f":"1/(1+12*($M$9/($M$11*PI()^2))*(BD107/($M$19-2*$R$11))^2)","v":0.9986623090977701},null,{"$f":"1/(1+12*($M$9/($M$11*PI()^2))*(BF107/($M$19-2*$R$11))^2)","v":0.72092309620248363},null,20,26.25,97.5,16,12,null,19.844275726034919,"OK",19.844275726034919,"OK",75.483870967741922,"OK",75.483870967741922,"OK"]
[null,null,null,null,null,null,null,null,null,null,null,null,null,null,null,null,null,null,null,null,null,null,null,null,null,null,null,null,null,null,null,null,null,null,null,null,"Fejltabel",null,{"$f":"IF(MAX(AM114:AM133,AM135:AM142)=0,TRUE,FALSE)","v":false},null,null,"PROJEKTTYPE",null,null,null,null,null,null,null,null,"NCR",{"$f":"AZ112*$R$8*($M$19-2*$R$11)","v":651.15634495708196},null,{"$f":"BB112*$R$8*($M$19-2*$R$11)","v":701.43318326555107},null,{"$f":"BD112*$R$8*($M$19-2*$R$11)","v":902.01756950766321},null,{"$f":"BF112*$R$8*($M$19-2*$R$11)","v":651.15634495708196},null,20,26.25,97.5,16,12,null,19.844275726034919,"OK",19.844275726034919,"OK",75.483870967741922,"OK",75.483870967741922,"OK"]
[null,null,null,null,null,null,null,null,null,null,null,null,null,null,null,null,null,null,null,null,null,null,null,null,null,null,null,null,null,null,null,null,null,null,null,null,"Programmet modtager ikke negative inddata. ",{"$f":"IF(AM114=0,\"\",AK114)","v":""},{"$f":"IF(MIN(M8:M9,M12:M13,R11,M17:M19,P15:S19,M21,Q20:Q21,K25:S25,Q27:R27,Q31:R40,N40:P40,S31,S35)<0,1,0)","v":0},null,null,"Res:",{"$f":"IF(AP116=\"\",\"\"&AQ117,\" \"&AQ116)","v":"Overslagsberegning"},null,null,null,null,null,null,null,null,null,null,null,null,null,null,null,null,null,null,null,null,null,null,"Brud",{"$f":"COUNTIF(BO105:BO113,\"Brud\")","v":0},null,{"$f":"COUNTIF(BQ105:BQ113,\"Brud\")","v":0},"Brud",{"$f":"COUNTIF(BS105:BS113,\"Brud\")","v":0},null,{"$f":"COUNTIF(BU105:BU113,\"Brud\")","v":0}]
[null,null,null,null,null,null,null,null,null,null,null,null,null,null,null,null,null,null,null,null,null,null,null,null,null,null,null,null,null,null,null,null,null,null,null,null,"Densitet skal være mindst 1200 kg/m3). ",{"$f":"IF(AM115=0,\"\",AK115)","v":""},{"$f":"IF(M8<1200,1,0)","v":0},null,null,null,null,null,null,null,null,null,null,null,null,null,null,null,null,null,null,null,null,null,null,null,null,null,null,"Eksist.",{"$f":"AP13","v":true},null,{"$f":"AP17","v":true},"Eksist.",{"$f":"AP13","v":true},null,{"$f":"AP17","v":true}]
[null,null,null,null,null,null,null,null,null,null,null,null,null,null,null,null,null,null,null,null,null,null,null,null,null,null,null,null,null,null,null,null,null,null,null,null,"Partialkoefficienter skal være mellem 1 og 2. ","",{"$f":"IF(OR(M12<1,M13<1,M12>2,M13>2),1,0)","v":0},null,null,{"$f":"AO117&AO118&AO119&AO120&AO121&AO122&AO123&AO124&AO125&AO126&AO127&AO128","v":""},"Overslagsberegning",null,null,null,null,null,null,null,null,null,null,null,null,null,null,null,null,null,null,null,null,null,null,"Besked:",{"$f":"IF(AND(BO115,BO114>0),\"(Bjælke A)\",\"\")","v":""},null,{"$f":"IF(AND(BQ115,BQ114>0),\"(Bjælke B)\",\"\")","v":""},"Besked:",{"$f":"IF(AND(BS115,BS114>0),\"(Bjælke A)\",\"\")","v":""},null,{"$f":"IF(AND(BU115,BU114>0),\"(Bjælke B)\",\"\")","v":""}]
[null,null,null,null,null,null,null,null,null,null,null,null,null,null,null,null,null,null,null,null,null,null,null,null,null,null,null,null,null,null,null,null,null,null,null,null,"Geometrikonflikt. ","",{"$f":"IF(OR(AZ14<AZ15,BB14<BB15,BD14<BD15,BF14<BF15),1,0)","v":0},null,null,123,"Overslagsberegning"]
[null,null,null,null,null,null,null,null,null,null,null,null,null,null,null,null,null,null,null,null,null,null,null,null,null,null,null,null,null,null,null,null,null,null,null,null,"Geometrikonflikt. ","",{"$f":"IF(OR(BB10<AZ14,BD10<BB14,BF10<BD14),1,0)","v":0},null,{"$f":"IF(AND(AP118=$AP$117,AQ118=$AQ$116),AP118,\"\")","v":""},"BEF1","Leverandørprojekt: CRH Concrete, Purhusvej 20, Linå • 8600 Silkeborg"]
[null,null,null,null,null,null,null,null,null,null,null,null,null,null,null,null,null,null,null,null,null,null,null,null,null,null,null,null,null,null,null,null,null,null,null,null,"Overligger under 200 mm. ","",{"$f":"IF(MAX(AS12,AU12,AW12)>AL10-200,1,0)","v":0},null,{"$f":"IF(AND(AP119=$AP$117,AQ119=$AQ$116),AP119,\"\")","v":""},"BEF2","Leverandørprojekt: CRH Concrete, Ribevej 45 • 6650 Brørup"]
[null,null,null,null,null,null,null,null,null,null,null,null,null,null,null,null,null,null,null,null,null,null,null,null,null,null,null,null,null,null,null,null,null,null,null,null,"Lodret bæreevne overskredet: ","",{"$f":"IF(MAX(AM121:AM124)=0,0,1)","v":0},null,"","BEF3","Leverandørprojekt: CRH Concrete, Bækgårdsvej 74 • 4140 Borup"]
[null,null,null,null,null,null,null,null,null,null,null,null,null,null,null,null,null,null,null,null,null,null,null,null,null,null,null,null,null,null,null,null,null,null,null,null,null,{"$f":"IF(AM120=0,\"\",CY54)","v":""},{"$f":"IF(CX54=0,0,1)","v":0},null,"","BEF4","Leverandørprojekt: CRH Concrete, Snavevej 23 • 5471 Søndersø"]
[null,null,null,null,null,null,null,null,null,null,null,null,null,null,null,null,null,null,null,null,null,null,null,null,null,null,null,null,null,null,null,null,null,null,null,null,null,{"$f":"IF(AM121=0,\"\",CY64)","v":""},{"$f":"IF(CX64=0,0,1)","v":0},null,"","BEF5","Leverandørprojekt: Gandrup Element, Teglværksvej 35 • 9362 Gandrup"]
[null,null,null,null,null,null,null,null,null,null,null,null,null,null,null,null,null,null,null,null,null,null,null,null,null,null,null,null,null,null,null,null,null,null,null,null,null,{"$f":"IF(AM122=0,\"\",CY74)","v":""},{"$f":"IF(CX74=0,0,1)","v":0},null,"","BEF6","Leverandørprojekt: Give Elementfabrik A/S, Hjortsvangen 19 • 7323 Give"]
[null,null,null,null,null,null,null,null,null,null,null,null,null,null,null,null,null,null,null,null,null,null,null,null,null,null,null,null,null,null,null,null,null,null,null,null,null,{"$f":"IF(AM123=0,\"\",CY84)","v":""},{"$f":"IF(CX84=0,0,1)","v":0},null,"","BEF7","Leverandørprojekt: Leth Beton A/S, Rishøjvej 26 • 7755 Bedsted Thy\n"]
[null,null,null,null,null,null,null,null,null,null,null,null,null,null,null,null,null,null,null,null,null,null,null,null,null,null,null,null,null,null,null,null,null,null,null,null,null,"",null,null,"","BEF8","Leverandørprojekt: Niss Sørensen & søn a-s, Drosselvej 9, P.B. 19, Balling • 7860 Spøttrup"]
[null,null,null,null,null,null,null,null,null,null,null,null,null,null,null,null,null,null,null,null,null,null,null,null,null,null,null,null,null,null,null,null,null,null,null,null,null,"",null,null,"","BEF9","Leverandørprojekt: Præfa-Byg v/O.J. Beton A/S, Høngårdsvej 30 • 9750 Øster Vrå"]
[null,null,null,null,null,null,null,null,null,null,null,null,null,null,null,null,null,null,null,null,null,null,null,null,null,null,null,null,null,null,null,null,null,null,null,null,null,"",null,null,"","BEF10","Leverandørprojekt: Contiga Tinglev A/S Mads Clausens Vej 58 • 6360 Tinglev"]
[null,null,null,null,null,null,null,null,null,null,null,null,null,null,null,null,null,null,null,null,null,null,null,null,null,null,null,null,null,null,null,null,null,null,null,null,null,"",null,null,"","BEF11","Leverandørprojekt: Fårup Betonindustri A/S Kærvej 1• 8990 Fårup"]
[null,null,null,null,null,null,null,null,null,null,null,null,null,null,null,null,null,null,null,null,null,null,null,null,null,null,null,null,null,null,null,null,null,null,null,null,null,""]
[null,null,null,null,null,null,null,null,null,null,null,null,null,null,null,null,null,null,null,null,null,null,null,null,null,null,null,null,null,null,null,null,null,null,null,null,null,""]
[null,null,null,null,null,null,null,null,null,null,null,null,null,null,null,null,null,null,null,null,null,null,null,null,null,null,null,null,null,null,null,null,null,null,null,null,null,""]
[null,null,null,null,null,null,null,null,null,null,null,null,null,null,null,null,null,null,null,null,null,null,null,null,null,null,null,null,null,null,null,null,null,null,null,null,null,""]
[null,null,null,null,null,null,null,null,null,null,null,null,null,null,null,null,null,null,null,null,null,null,null,null,null,null,null,null,null,null,null,null,null,null,null,null,null,""]
[null,null,null,null,null,null,null,null,null,null,null,null,null,null,null,null,null,null,null,null,null,null,null,null,null,null,null,null,null,null,null,null,null,null,null,"Sat ud af kraft",{"$f":"\"Afskalningsbrud \"&BO95&BO116&BQ116","v":"Afskalningsbrud "},{"$f":"IF(AM134=0,\"\",AK134)","v":""},{"$f":"0*IF(AND(BO95=\"\",BO116=\"\",BQ116=\"\"),0,1)","v":0}]
[null,null,null,null,null,null,null,null,null,null,null,null,null,null,null,null,null,null,null,null,null,null,null,null,null,null,null,null,null,null,null,null,null,null,null,null,{"$f":"\"Vederlagsbrud \"&BS95&BS116&BU116","v":"Vederlagsbrud "},"",{"$f":"IF(AND(BS95=\"\",BS116=\"\",BU116=\"\"),0,1)","v":0}]
[null,null,null,null,null,null,null,null,null,null,null,null,null,null,null,null,null,null,null,null,null,null,null,null,null,null,null,null,null,null,null,null,null,null,null,null,"For ny bruger: Klik på knappen 'angiv nyt brugernavn' for ibrugtagning.",{"$f":"IF(AM136=1,AK136,\"\")","v":"For ny bruger: Klik på knappen 'angiv nyt brugernavn' for ibrugtagning."},{"$f":"Makro!E20","v":1}]
[null,null,null,null,null,null,null,null,null,null,null,null,null,null,null,null,null,null,null,null,null,null,null,null,null,null,null,null,null,null,null,null,null,null,null,null,null,""]
[null,null,null,null,null,null,null,null,null,null,null,null,null,null,null,null,null,null,null,null,null,null,null,null,null,null,null,null,null,null,null,null,null,null,null,null,null,""]
[null,null,null,null,null,null,null,null,null,null,null,null,null,null,null,null,null,null,null,null,null,null,null,null,null,null,null,null,null,null,null,null,null,null,null,null,null,""]
[null,null,null,null,null,null,null,null,null,null,null,null,null,null,null,null,null,null,null,null,null,null,null,null,null,null,null,null,null,null,null,null,null,null,null,null,null,""]
[null,null,null,null,null,null,null,null,null,null,null,null,null,null,null,null,null,null,null,null,null,null,null,null,null,null,null,null,null,null,null,null,null,null,null,null,null,""]
[null,null,null,null,null,null,null,null,null,null,null,null,null,null,null,null,null,null,null,null,null,null,null,null,null,null,null,null,null,null,null,null,null,null,null,null,null,""]

{"sheet":"Sheet2","index":1,"n_rows":41,"n_cols":43,"rows_kept":41,"cut":false,"hidden":false,"merged":[[41,11,41,19],[25,15,25,16],[2,3,2,7],[2,9,2,10],[3,3,3,7],[3,9,3,10],[27,14,27,16],[4,3,4,7],[4,9,4,10],[32,1,32,2],[1,11,1,14],[1,15,1,19],[22,11,22,13],[22,14,22,16],[26,15,26,16],[22,17,22,19],[3,11,4,19],[21,1,21,2],[9,2,9,4],[9,5,9,7],[9,8,9,10],[31,1,31,2],[27,1,27,2],[25,1,25,2],[26,1,26,2],[38,1,38,2],[39,1,39,2],[33,21,35,24],[36,22,39,24],[40,21,40,24],[40,1,40,2],[33,1,33,2],[37,1,37,2],[34,1,34,2],[35,1,35,2],[36,1,36,2],[30,1,30,2],[22,1,22,2],[23,1,23,2],[24,1,24,2],[28,1,28,2],[29,1,29,2]]}
[]
[null,null,null,null,null,null,null,null,null,null,null,{"$f":"Sheet1!K2","v":" Letbetonvæg"},{"$f":"Sheet1!L2","v":0},{"$f":"Sheet1!M2","v":0},{"$f":"Sheet1!N2","v":0},{"$f":"Sheet1!O2","v":"Betonelement-Foreningen Feb 2019"}]
[null,"Sagsnavn:",null,{"$f":"Sheet1!C3","v":"Letbetonhuset"},0,0,0,0,{"$f":"Sheet1!H3","v":"Sag nr.:"},{"$f":"Sheet1!I3","v":"23 - 4545"},0]
[null,"Bygningsdel:",null,{"$f":"Sheet1!C4","v":"Væg i modul B-C/3"},0,0,0,0,{"$f":"Sheet1!H4","v":"Dato:"},{"$f":"Sheet1!I4","v":"2019-01-01"},"00:00:00",{"$f":"Sheet1!K4","v":"NB : For ny bruger: Klik på knappen 'angiv nyt brugernavn' for ibrugtagning."}]
[null,"Emne:",null,{"$f":"Sheet1!C5&\", kontrol :   \"&INDEX(AL8:AL11,AM8,1)","v":"Normale lastkombinationer, kontrol :   Felt #3"},0,0,0,0,{"$f":"Sheet1!H5","v":"Init:"},{"$f":"Sheet1!I5","v":"JFJ"},0]
[]
[null,"Totaler","A","B","C","D","E","F","G","H","I","Materialeparametre",null,null,null,"Afledte parametre"]
[null,"N     (kN)",{"$f":"C13*D13+F13*G13+I13*J13","v":{"$error":"#VALUE!"}},{"$f":"C14*D14+F14*G14+I14*J14","v":{"$error":"#VALUE!"}},{"$f":"C15*D15+F15*G15+I15*J15","v":{"$error":"#VALUE!"}},{"$f":"C16*D16+F16*G16+I16*J16","v":{"$error":"#VALUE!"}},{"$f":"C17*D17+F17*G17+I17*J17","v":{"$error":"#VALUE!"}},{"$f":"C18*D18+F18*G18+I18*J18","v":{"$error":"#VALUE!"}},{"$f":"C19*D19+F19*G19+I19*J19","v":{"$error":"#VALUE!"}},{"$f":"C20*D20+F20*G20+I20*J20","v":{"$error":"#VALUE!"}},{"$f":"C21*D21+F21*G21+I21*J21","v":{"$error":"#VALUE!"}},null,"d",{"$f":"Sheet1!M8","v":1800},"kg/m3",null,null,"fcd",{"$f":"Sheet1!R8","v":6.4516129032258061},"MPa",null,null,null,null,null,null,null,null,null,null,null,null,null,null,null,null,null,"Felt #1",{"$f":"Makro!D1","v":4},null,null,"b1",{"$f":"S16+0.5*R16","v":2000}]
[null,"M  (kNm)",{"$f":"C13*E13+F13*H13+I13*K13","v":{"$error":"#VALUE!"}},{"$f":"C14*E14+F14*H14+I14*K14","v":{"$error":"#VALUE!"}},{"$f":"C15*E15+F15*H15+I15*K15","v":{"$error":"#VALUE!"}},{"$f":"C16*E16+F16*H16+I16*K16","v":{"$error":"#VALUE!"}},{"$f":"C17*E17+F17*H17+I17*K17","v":{"$error":"#VALUE!"}},{"$f":"C18*E18+F18*H18+I18*K18","v":{"$error":"#VALUE!"}},{"$f":"C19*E19+F19*H19+I19*K19","v":{"$error":"#VALUE!"}},{"$f":"C20*E20+F20*H20+I20*K20","v":{"$error":"#VALUE!"}},{"$f":"C21*E21+F21*H21+I21*K21","v":{"$error":"#VALUE!"}},null,"fck",{"$f":"Sheet1!M9","v":10},"MPa",null,null,"fctd",{"$f":"Sheet1!R9","v":1.085498843133534},"MPa",null,null,null,null,null,null,null,null,null,null,null,null,null,null,null,null,null,{"$f":"IF(Sheet1!BS9,\"Felt #2\",AL8)","v":"Felt #2"},{"$f":"MIN(AM8,AM10)","v":3},null,null,"b2",{"$f":"S17-S16-R16+0.5*(R16+R17)","v":-2000}]
[null,"Udsnit","Venstre delfelt",null,null,"Midterdel",null,null,"Højre delfelt",null,null,null,"ftk",{"$f":"0.42*N9^(2/3)*(0.4+0.6*N8/2200)","v":1.7367981490136544},"MPa","Søjlebæreevne",null,"Ls",{"$f":"Sheet1!R10","v":3000},"mm",null,null,null,null,null,null,null,null,null,null,null,null,null,null,null,null,null,{"$f":"IF(Sheet1!BS19,\"Felt #3\",AL9)","v":"Felt #3"},{"$f":"IF(Sheet1!BS29,4,IF(Sheet1!BS19,3,IF(Sheet1!BS9,2,1)))","v":3},null,null,"b3",{"$f":"S18-S17-R17+0.5*(R17+R18)","v":6000}]
[null,null,"s","n","m","s","n","m","s","n","m",null,"Ecm",{"$f":"10000*N9^(1/3)*(N8/2200)^2","v":14422.248751453108},"MPa","(uden tværvægge)",null,"e5",{"$f":"Sheet1!R11","v":5},"mm",null,null,null,null,null,null,null,null,null,null,null,null,null,null,null,null,null,{"$f":"IF(Sheet1!BS29,\"Felt #4\",AL10)","v":"Felt #3"},null,null,null,"b4",{"$f":"N18-S18-R18+0.5*R18","v":1000}]
[null,null,"(m)","(kN/m)","(kNm/m)","(m)","(kN/m)","(kNm/m)","(m)","(kN/m)","(kNm/m)",null,"gcm",{"$f":"Sheet1!M12","v":1.55},null,null,null,"ks",{"$f":"Sheet1!R12","v":0.72092309620248363},null,null,null,null,null,null,null,null,null,null,null,null,null,null,null,null,null,null,null,null,null,null,"B",{"$f":"INDEX(AQ8:AQ11,AM8,1)/1000","v":1}]
[null,{"$f":"L31","v":"A"},{"$f":"IF(Sheet1!$AM$113,OFFSET(Sheet1!CI10,(Sheet2!$AM$9-1)*10,0),\"-\")","v":"-"},{"$f":"IF(Sheet1!$AM$113,OFFSET(Sheet1!CL10,(Sheet2!$AM$9-1)*10,0)*1000,\"-\")","v":"-"},{"$f":"IF(Sheet1!$AM$113,OFFSET(Sheet1!CM10,(Sheet2!$AM$9-1)*10,0)*1000,\"-\")","v":"-"},{"$f":"IF(Sheet1!$AM$113,OFFSET(Sheet1!CJ10,(Sheet2!$AM$9-1)*10,0),\"-\")","v":"-"},{"$f":"IF(Sheet1!$AM$113,OFFSET(Sheet1!CP10,(Sheet2!$AM$9-1)*10,0)*1000,\"-\")","v":"-"},{"$f":"IF(Sheet1!$AM$113,OFFSET(Sheet1!CQ10,(Sheet2!$AM$9-1)*10,0)*1000,\"-\")","v":"-"},{"$f":"IF(Sheet1!$AM$113,OFFSET(Sheet1!CK10,(Sheet2!$AM$9-1)*10,0),\"-\")","v":"-"},{"$f":"IF(Sheet1!$AM$113,OFFSET(Sheet1!CT10,(Sheet2!$AM$9-1)*10,0)*1000,\"-\")","v":"-"},{"$f":"IF(Sheet1!$AM$113,OFFSET(Sheet1!CU10,(Sheet2!$AM$9-1)*10,0)*1000,\"-\")","v":"-"},null,"gtm",{"$f":"Sheet1!M13","v":1.6},null,null,null,"Ncr",{"$f":"Sheet1!R13","v":651.15634495708196},"kN/m",null,null,null,null,null,null,null,null,null,null,null,null,null,null,null,null,null,null,null,null,null,"N","M"]
[null,"B",{"$f":"IF(Sheet1!$AM$113,OFFSET(Sheet1!CI11,(Sheet2!$AM$9-1)*10,0),\"-\")","v":"-"},{"$f":"IF(Sheet1!$AM$113,OFFSET(Sheet1!CL11,(Sheet2!$AM$9-1)*10,0)*1000,\"-\")","v":"-"},{"$f":"IF(Sheet1!$AM$113,OFFSET(Sheet1!CM11,(Sheet2!$AM$9-1)*10,0)*1000,\"-\")","v":"-"},{"$f":"IF(Sheet1!$AM$113,OFFSET(Sheet1!CJ11,(Sheet2!$AM$9-1)*10,0),\"-\")","v":"-"},{"$f":"IF(Sheet1!$AM$113,OFFSET(Sheet1!CP11,(Sheet2!$AM$9-1)*10,0)*1000,\"-\")","v":"-"},{"$f":"IF(Sheet1!$AM$113,OFFSET(Sheet1!CQ11,(Sheet2!$AM$9-1)*10,0)*1000,\"-\")","v":"-"},{"$f":"IF(Sheet1!$AM$113,OFFSET(Sheet1!CK11,(Sheet2!$AM$9-1)*10,0),\"-\")","v":"-"},{"$f":"IF(Sheet1!$AM$113,OFFSET(Sheet1!CT11,(Sheet2!$AM$9-1)*10,0)*1000,\"-\")","v":"-"},{"$f":"IF(Sheet1!$AM$113,OFFSET(Sheet1!CU11,(Sheet2!$AM$9-1)*10,0)*1000,\"-\")","v":"-"},"Geometri - alle mål i mm",null,null,"Udsparinger",null,"h","b","x","y",null,null,null,null,null,null,null,null,null,null,null,null,null,null,null,null,null,null,null,null,null,{"$f":"(O31+P31+Q31)*$AQ$12+IF($AM$8=1,IF($R$27=\"\",R31,0.5*$R$27*(O31+P31+Q31)))+IF($AM$8=4,S31)","v":4.8},{"$f":"((O31*$O$41+P31*$P$41-Q31*$Q$41)*$AQ$12+IF($AM$8=1,IF($R$27=\"\",R31*$R$41,0.5*$R$27*(O31*$O$41+P31*$P$41-Q31*$Q$41)),0))/1000+0.125*($AQ$12+IF($AM$8=1,(IF($R$27=\"\",0,0.5*$R$27)),0))*T31*($S$10/1000)^2+IF($AM$8=4,S31*$S$41,0)/1000","v":{"$error":"#VALUE!"}}]
[null,"C",{"$f":"IF(Sheet1!$AM$113,OFFSET(Sheet1!CI12,(Sheet2!$AM$9-1)*10,0),\"-\")","v":"-"},{"$f":"IF(Sheet1!$AM$113,OFFSET(Sheet1!CL12,(Sheet2!$AM$9-1)*10,0)*1000,\"-\")","v":"-"},{"$f":"IF(Sheet1!$AM$113,OFFSET(Sheet1!CM12,(Sheet2!$AM$9-1)*10,0)*1000,\"-\")","v":"-"},{"$f":"IF(Sheet1!$AM$113,OFFSET(Sheet1!CJ12,(Sheet2!$AM$9-1)*10,0),\"-\")","v":"-"},{"$f":"IF(Sheet1!$AM$113,OFFSET(Sheet1!CP12,(Sheet2!$AM$9-1)*10,0)*1000,\"-\")","v":"-"},{"$f":"IF(Sheet1!$AM$113,OFFSET(Sheet1!CQ12,(Sheet2!$AM$9-1)*10,0)*1000,\"-\")","v":"-"},{"$f":"IF(Sheet1!$AM$113,OFFSET(Sheet1!CK12,(Sheet2!$AM$9-1)*10,0),\"-\")","v":"-"},{"$f":"IF(Sheet1!$AM$113,OFFSET(Sheet1!CT12,(Sheet2!$AM$9-1)*10,0)*1000,\"-\")","v":"-"},{"$f":"IF(Sheet1!$AM$113,OFFSET(Sheet1!CU12,(Sheet2!$AM$9-1)*10,0)*1000,\"-\")","v":"-"},null,null,null,"  Bjælke A",null,{"$f":"Sheet1!P15","v":500},{"$f":"Sheet1!Q15","v":150},null,null,null,null,null,null,null,null,null,null,null,null,null,null,null,null,null,null,null,null,null,null,null,6.4,{"$error":"#VALUE!"}]
[null,"D",{"$f":"IF(Sheet1!$AM$113,OFFSET(Sheet1!CI13,(Sheet2!$AM$9-1)*10,0),\"-\")","v":"-"},{"$f":"IF(Sheet1!$AM$113,OFFSET(Sheet1!CL13,(Sheet2!$AM$9-1)*10,0)*1000,\"-\")","v":"-"},{"$f":"IF(Sheet1!$AM$113,OFFSET(Sheet1!CM13,(Sheet2!$AM$9-1)*10,0)*1000,\"-\")","v":"-"},{"$f":"IF(Sheet1!$AM$113,OFFSET(Sheet1!CJ13,(Sheet2!$AM$9-1)*10,0),\"-\")","v":"-"},{"$f":"IF(Sheet1!$AM$113,OFFSET(Sheet1!CP13,(Sheet2!$AM$9-1)*10,0)*1000,\"-\")","v":"-"},{"$f":"IF(Sheet1!$AM$113,OFFSET(Sheet1!CQ13,(Sheet2!$AM$9-1)*10,0)*1000,\"-\")","v":"-"},{"$f":"IF(Sheet1!$AM$113,OFFSET(Sheet1!CK13,(Sheet2!$AM$9-1)*10,0),\"-\")","v":"-"},{"$f":"IF(Sheet1!$AM$113,OFFSET(Sheet1!CT13,(Sheet2!$AM$9-1)*10,0)*1000,\"-\")","v":"-"},{"$f":"IF(Sheet1!$AM$113,OFFSET(Sheet1!CU13,(Sheet2!$AM$9-1)*10,0)*1000,\"-\")","v":"-"},"Hovedmål",null,null,"  Vindue 1",null,{"$f":"Sheet1!P16","v":1500},{"$f":"Sheet1!Q16","v":1500},{"$f":"Sheet1!R16","v":1250},{"$f":"Sheet1!S16","v":1000},null,null,null,null,null,null,null,null,null,null,null,null,null,null,null,null,null,null,null,null,null,25.6,{"$error":"#VALUE!"}]
[null,"E",{"$f":"IF(Sheet1!$AM$113,OFFSET(Sheet1!CI14,(Sheet2!$AM$9-1)*10,0),\"-\")","v":"-"},{"$f":"IF(Sheet1!$AM$113,OFFSET(Sheet1!CL14,(Sheet2!$AM$9-1)*10,0)*1000,\"-\")","v":"-"},{"$f":"IF(Sheet1!$AM$113,OFFSET(Sheet1!CM14,(Sheet2!$AM$9-1)*10,0)*1000,\"-\")","v":"-"},{"$f":"IF(Sheet1!$AM$113,OFFSET(Sheet1!CJ14,(Sheet2!$AM$9-1)*10,0),\"-\")","v":"-"},{"$f":"IF(Sheet1!$AM$113,OFFSET(Sheet1!CP14,(Sheet2!$AM$9-1)*10,0)*1000,\"-\")","v":"-"},{"$f":"IF(Sheet1!$AM$113,OFFSET(Sheet1!CQ14,(Sheet2!$AM$9-1)*10,0)*1000,\"-\")","v":"-"},{"$f":"IF(Sheet1!$AM$113,OFFSET(Sheet1!CK14,(Sheet2!$AM$9-1)*10,0),\"-\")","v":"-"},{"$f":"IF(Sheet1!$AM$113,OFFSET(Sheet1!CT14,(Sheet2!$AM$9-1)*10,0)*1000,\"-\")","v":"-"},{"$f":"IF(Sheet1!$AM$113,OFFSET(Sheet1!CU14,(Sheet2!$AM$9-1)*10,0)*1000,\"-\")","v":"-"},"  Væghøjde,    H",null,{"$f":"Sheet1!M17","v":3000},"  Dør",null,{"$f":"Sheet1!P17","v":0},{"$f":"Sheet1!Q17","v":0},{"$f":"Sheet1!R17","v":0},{"$f":"Sheet1!S17","v":0},null,null,null,null,null,null,null,null,null,null,null,null,null,null,null,null,null,null,null,null,null,25.6,{"$error":"#VALUE!"}]
[null,"F",{"$f":"IF(Sheet1!$AM$113,OFFSET(Sheet1!CI15,(Sheet2!$AM$9-1)*10,0),\"-\")","v":"-"},{"$f":"IF(Sheet1!$AM$113,OFFSET(Sheet1!CL15,(Sheet2!$AM$9-1)*10,0)*1000,\"-\")","v":"-"},{"$f":"IF(Sheet1!$AM$113,OFFSET(Sheet1!CM15,(Sheet2!$AM$9-1)*10,0)*1000,\"-\")","v":"-"},{"$f":"IF(Sheet1!$AM$113,OFFSET(Sheet1!CJ15,(Sheet2!$AM$9-1)*10,0),\"-\")","v":"-"},{"$f":"IF(Sheet1!$AM$113,OFFSET(Sheet1!CP15,(Sheet2!$AM$9-1)*10,0)*1000,\"-\")","v":"-"},{"$f":"IF(Sheet1!$AM$113,OFFSET(Sheet1!CQ15,(Sheet2!$AM$9-1)*10,0)*1000,\"-\")","v":"-"},{"$f":"IF(Sheet1!$AM$113,OFFSET(Sheet1!CK15,(Sheet2!$AM$9-1)*10,0),\"-\")","v":"-"},{"$f":"IF(Sheet1!$AM$113,OFFSET(Sheet1!CT15,(Sheet2!$AM$9-1)*10,0)*1000,\"-\")","v":"-"},{"$f":"IF(Sheet1!$AM$113,OFFSET(Sheet1!CU15,(Sheet2!$AM$9-1)*10,0)*1000,\"-\")","v":"-"},"  Vægbredde,  B",null,{"$f":"Sheet1!M18","v":7000},"  Vindue 2",null,{"$f":"Sheet1!P18","v":1500},{"$f":"Sheet1!Q18","v":1000},{"$f":"Sheet1!R18","v":5500},{"$f":"Sheet1!S18","v":1000},null,null,null,null,null,null,null,null,null,null,null,null,null,null,null,null,null,null,null,null,null,8,{"$error":"#VALUE!"}]
[null,"G",{"$f":"IF(Sheet1!$AM$113,OFFSET(Sheet1!CI16,(Sheet2!$AM$9-1)*10,0),\"-\")","v":"-"},{"$f":"IF(Sheet1!$AM$113,OFFSET(Sheet1!CL16,(Sheet2!$AM$9-1)*10,0)*1000,\"-\")","v":"-"},{"$f":"IF(Sheet1!$AM$113,OFFSET(Sheet1!CM16,(Sheet2!$AM$9-1)*10,0)*1000,\"-\")","v":"-"},{"$f":"IF(Sheet1!$AM$113,OFFSET(Sheet1!CJ16,(Sheet2!$AM$9-1)*10,0),\"-\")","v":"-"},{"$f":"IF(Sheet1!$AM$113,OFFSET(Sheet1!CP16,(Sheet2!$AM$9-1)*10,0)*1000,\"-\")","v":"-"},{"$f":"IF(Sheet1!$AM$113,OFFSET(Sheet1!CQ16,(Sheet2!$AM$9-1)*10,0)*1000,\"-\")","v":"-"},{"$f":"IF(Sheet1!$AM$113,OFFSET(Sheet1!CK16,(Sheet2!$AM$9-1)*10,0),\"-\")","v":"-"},{"$f":"IF(Sheet1!$AM$113,OFFSET(Sheet1!CT16,(Sheet2!$AM$9-1)*10,0)*1000,\"-\")","v":"-"},{"$f":"IF(Sheet1!$AM$113,OFFSET(Sheet1!CU16,(Sheet2!$AM$9-1)*10,0)*1000,\"-\")","v":"-"},"  Vægtykkelse, t",null,{"$f":"Sheet1!M19","v":150},"  Bjælke B",null,{"$f":"Sheet1!P19","v":500},{"$f":"Sheet1!Q19","v":150},null,null,null,null,null,null,null,null,null,null,null,null,null,null,null,null,null,null,null,null,null,null,null,27.2,{"$error":"#VALUE!"}]
[null,"H",{"$f":"IF(Sheet1!$AM$113,OFFSET(Sheet1!CI17,(Sheet2!$AM$9-1)*10,0),\"-\")","v":"-"},{"$f":"IF(Sheet1!$AM$113,OFFSET(Sheet1!CL17,(Sheet2!$AM$9-1)*10,0)*1000,\"-\")","v":"-"},{"$f":"IF(Sheet1!$AM$113,OFFSET(Sheet1!CM17,(Sheet2!$AM$9-1)*10,0)*1000,\"-\")","v":"-"},{"$f":"IF(Sheet1!$AM$113,OFFSET(Sheet1!CJ17,(Sheet2!$AM$9-1)*10,0),\"-\")","v":"-"},{"$f":"IF(Sheet1!$AM$113,OFFSET(Sheet1!CP17,(Sheet2!$AM$9-1)*10,0)*1000,\"-\")","v":"-"},{"$f":"IF(Sheet1!$AM$113,OFFSET(Sheet1!CQ17,(Sheet2!$AM$9-1)*10,0)*1000,\"-\")","v":"-"},{"$f":"IF(Sheet1!$AM$113,OFFSET(Sheet1!CK17,(Sheet2!$AM$9-1)*10,0),\"-\")","v":"-"},{"$f":"IF(Sheet1!$AM$113,OFFSET(Sheet1!CT17,(Sheet2!$AM$9-1)*10,0)*1000,\"-\")","v":"-"},{"$f":"IF(Sheet1!$AM$113,OFFSET(Sheet1!CU17,(Sheet2!$AM$9-1)*10,0)*1000,\"-\")","v":"-"},"Interne overliggere",null,null,"Tværvæg 1",null,{"$f":"IF(Sheet1!P20=\"\",\"-\",Sheet1!P20)","v":"x ="},{"$f":"IF(Sheet1!Q20=\"\",\"\",Sheet1!Q20)","v":3000},null,null,null,null,null,null,null,null,null,null,null,null,null,null,null,null,null,null,null,null,null,null,null,27.2,{"$error":"#VALUE!"}]
[null,"I",{"$f":"IF(Sheet1!$AM$113,OFFSET(Sheet1!CI18,(Sheet2!$AM$9-1)*10,0),\"-\")","v":"-"},{"$f":"IF(Sheet1!$AM$113,OFFSET(Sheet1!CL18,(Sheet2!$AM$9-1)*10,0)*1000,\"-\")","v":"-"},{"$f":"IF(Sheet1!$AM$113,OFFSET(Sheet1!CM18,(Sheet2!$AM$9-1)*10,0)*1000,\"-\")","v":"-"},{"$f":"IF(Sheet1!$AM$113,OFFSET(Sheet1!CJ18,(Sheet2!$AM$9-1)*10,0),\"-\")","v":"-"},{"$f":"IF(Sheet1!$AM$113,OFFSET(Sheet1!CP18,(Sheet2!$AM$9-1)*10,0)*1000,\"-\")","v":"-"},{"$f":"IF(Sheet1!$AM$113,OFFSET(Sheet1!CQ18,(Sheet2!$AM$9-1)*10,0)*1000,\"-\")","v":"-"},{"$f":"IF(Sheet1!$AM$113,OFFSET(Sheet1!CK18,(Sheet2!$AM$9-1)*10,0),\"-\")","v":"-"},{"$f":"IF(Sheet1!$AM$113,OFFSET(Sheet1!CT18,(Sheet2!$AM$9-1)*10,0)*1000,\"-\")","v":"-"},{"$f":"IF(Sheet1!$AM$113,OFFSET(Sheet1!CU18,(Sheet2!$AM$9-1)*10,0)*1000,\"-\")","v":"-"},"  Vederlagsdybder",null,{"$f":"Sheet1!M21","v":135},"Tværvæg 2",null,{"$f":"IF(Sheet1!P21=\"\",\"-\",Sheet1!P21)","v":"x ="},{"$f":"IF(Sheet1!Q21=\"\",\"\",Sheet1!Q21)","v":6750},null,null,null,null,null,null,null,null,null,null,null,null,null,null,null,null,null,null,null,null,null,null,null,32,{"$error":"#VALUE!"}]
[null,null,null,null,null,null,null,null,null,null,null,"Jævnt fordelte laste på vægoverside",null,null,null,null,null,null,null,null,null,null,null,null,null,null,null,null,null,null,null,null,null,null,null,null,null,null,null,null,null,32,{"$error":"#VALUE!"}]
[null,null,null,null,null,null,null,null,null,null,null,"Maksimallaste (kN/m)",null,null,"Reducerede laste (kN/m)",null,null,"Minimallaste (kN/m)"]
[null,null,null,null,null,null,null,null,null,null,null,"nv","no","nh","nv","no","nh","nv","no","nh"]
[null,null,null,null,null,null,null,null,null,null,null,{"$f":"Sheet1!K25","v":5},{"$f":"Sheet1!L25","v":15},{"$f":"Sheet1!M25","v":0},{"$f":"Sheet1!N25","v":4},{"$f":"Sheet1!O25","v":12},{"$f":"Sheet1!P25","v":0},{"$f":"Sheet1!Q25","v":3},{"$f":"Sheet1!R25","v":0},{"$f":"Sheet1!S25","v":0}]
[null,null,null,null,null,null,null,null,null,null,null,"  Belastning fra bjælke A (venstre side) som:",null,null,null,{"$f":"Sheet1!O26","v":"Vægoverligger"},0,"LA (m)","LB (m)"]
[null,null,null,null,null,null,null,null,null,null,null,"  Belastning fra bjælke B (højre side) som:",null,null,null,{"$f":"Sheet1!O27","v":"Vægoverligger"},0,{"$f":"IF(Sheet1!Q27=\"\",\"\",Sheet1!Q27)","v":1.6},{"$f":"IF(Sheet1!R27=\"\",\"\",Sheet1!R27)","v":1.2}]
[null,null,null,null,null,null,null,null,null,null,null," Brudlasttilfælde",null,{"$f":"Sheet1!M28","v":1},{"$f":"Sheet1!N28","v":"Jævnt fordelt last, overside"},0,0,{"$f":"Sheet1!Q28","v":"Bjælkereaktioner"},null,{"$f":"Sheet1!S28","v":"Vind"}]
[null,null,null,null,null,null,null,null,null,null,null,null,null,null,"n1","n0","n2","NA","NB","w"]
[null,null,null,null,null,null,null,null,null,null,null,null,null,null,{"$f":"Sheet1!N30","v":"(kN/m)"},{"$f":"Sheet1!O30","v":"(kN/m)"},{"$f":"Sheet1!P30","v":"(kN/m)"},{"$f":"Sheet1!Q30","v":"(kN)  "},{"$f":"Sheet1!R30","v":"(kN)  "},{"$f":"Sheet1!S30","v":"(kN/m2)"}]
[null,null,null,null,null,null,null,null,null,null,null,"A","Med maksimal vind",null,{"$f":"Sheet1!N31","v":3},{"$f":"Sheet1!O31","v":0},{"$f":"Sheet1!P31","v":0},{"$f":"Sheet1!Q31","v":2.4000000000000004},{"$f":"Sheet1!R31","v":1.7999999999999998},{"$f":"Sheet1!S31","v":0.94}]
[null,null,null,null,null,null,null,null,null,null,null,"B",null,null,{"$f":"Sheet1!N32","v":4},{"$f":"Sheet1!O32","v":0},{"$f":"Sheet1!P32","v":0},{"$f":"Sheet1!Q32","v":3.2},{"$f":"Sheet1!R32","v":2.4},{"$f":"Sheet1!S32","v":0.94}]
[null,null,null,null,null,null,null,null,null,null,null,"C",null,null,{"$f":"Sheet1!N33","v":4},{"$f":"Sheet1!O33","v":12},{"$f":"Sheet1!P33","v":0},{"$f":"Sheet1!Q33","v":12.8},{"$f":"Sheet1!R33","v":9.6},{"$f":"Sheet1!S33","v":0.94}]
[null,null,null,null,null,null,null,null,null,null,null,"D",null,null,{"$f":"Sheet1!N34","v":4},{"$f":"Sheet1!O34","v":12},{"$f":"Sheet1!P34","v":0},{"$f":"Sheet1!Q34","v":12.8},{"$f":"Sheet1!R34","v":9.6},{"$f":"Sheet1!S34","v":0.94},null," NB:  Resultaterne skal altid kontrolleres af ansvarlig statiker"]
[null,null,null,null,null,null,null,null,null,null,null,"E","Med reduceret vind",null,{"$f":"Sheet1!N35","v":5},{"$f":"Sheet1!O35","v":0},{"$f":"Sheet1!P35","v":0},{"$f":"Sheet1!Q35","v":4},{"$f":"Sheet1!R35","v":3},{"$f":"Sheet1!S35","v":0.47}]
[null,null,null,null,null,null,null,null,null,null,null,"F",null,null,{"$f":"Sheet1!N36","v":5},{"$f":"Sheet1!O36","v":12},{"$f":"Sheet1!P36","v":0},{"$f":"Sheet1!Q36","v":13.600000000000001},{"$f":"Sheet1!R36","v":10.199999999999999},{"$f":"Sheet1!S36","v":0.47}]
[null,null,null,null,null,null,null,null,null,null,null,"G",null,null,{"$f":"Sheet1!N37","v":5},{"$f":"Sheet1!O37","v":12},{"$f":"Sheet1!P37","v":0},{"$f":"Sheet1!Q37","v":13.600000000000001},{"$f":"Sheet1!R37","v":10.199999999999999},{"$f":"Sheet1!S37","v":0.47},null,"Vejledning:","Helvægge og dæk af letbeton; bærevene og stabilitet. Dansk Beton, Letbetongruppen - BIH"]
[null,null,null,null,null,null,null,null,null,null,null,"H",null,null,{"$f":"Sheet1!N38","v":5},{"$f":"Sheet1!O38","v":15},{"$f":"Sheet1!P38","v":0},{"$f":"Sheet1!Q38","v":16},{"$f":"Sheet1!R38","v":12},{"$f":"Sheet1!S38","v":0.47}]
[null,null,null,null,null,null,null,null,null,null,null,"I",null,null,{"$f":"Sheet1!N39","v":5},{"$f":"Sheet1!O39","v":15},{"$f":"Sheet1!P39","v":0},{"$f":"Sheet1!Q39","v":16},{"$f":"Sheet1!R39","v":12},{"$f":"Sheet1!S39","v":0.47}]
[null,null,null,null,null,null,null,null,null,null,null," Excentricitet, top (mm):",null,null,{"$f":"Sheet1!N40","v":60},{"$f":"Sheet1!O40","v":15},{"$f":"Sheet1!P40","v":45},{"$f":"IF(R27=\"\",Sheet1!Q40,\"\")","v":""},{"$f":"IF(S27=\"\",Sheet1!R40,\"\")","v":""}]
[null,null,null,null,null,null,null,null,null,null,null," Excentricitet, eff. (mm) :",null,null,{"$f":"Sheet1!N41","v":45},{"$f":"Sheet1!O41","v":15},{"$f":"Sheet1!P41","v":25},{"$f":"IF(R27=\"\",Sheet1!Q41,\"\")","v":""},{"$f":"IF(S27=\"\",Sheet1!R41,\"\")","v":""},null,null,"Polyteknisk Forlag 2010 eller www.bef.dk"]

{"sheet":"Makro","index":2,"n_rows":20,"n_cols":5,"rows_kept":20,"cut":false,"hidden":false,"merged":[]}
[true,1,1,4]
[true,1,1]
[false]
[true]
[true]
[true]
[true]
[]
[]
[]
[]
[]
[]
[]
[]
[]
[]
[]
[]
[{"$f":"IF(E20=1,0,1000000)","v":0},null,null,null,1]